BDBM50334757 CHEMBL1642887::N-(Piperidin-4-yl)-3-(4-(trifluoromethyl)phenylsulfonyl)-1H-indazol-5-amine HCl
SMILES: FC(F)(F)c1ccc(cc1)S(=O)(=O)c1n[nH]c2ccc(NC3CCNCC3)cc12
InChI Key: InChIKey=HZRZQOUQOVQKQP-UHFFFAOYSA-N
Data: 1 KI  1 IC50
Activity Spreadsheet -- Enzyme Inhibition Constant Data from BindingDB
Found 2 hits for monomerid = 50334757
Trg + Lig
Ki
nM
ΔG°
kcal/mole
IC50
nM
Kd
nM
EC50/IC50
nM
koff
s-1
kon
M-1s-1
pHTemp
°C
5-hydroxytryptamine receptor 6
(Homo sapiens (Human))
BDBM50334757
(CHEMBL1642887 | N-(Piperidin-4-yl)-3-(4-(trifluoro...)
Show SMILES FC(F)(F)c1ccc(cc1)S(=O)(=O)c1n[nH]c2ccc(NC3CCNCC3)cc12
Show InChI InChI=1S/C19H19F3N4O2S/c20-19(21,22)12-1-4-15(5-2-12)29(27,28)18-16-11-14(3-6-17(16)25-26-18)24-13-7-9-23-10-8-13/h1-6,11,13,23-24H,7-10H2,(H,25,26)
Reactome pathway
1.5n/an/an/an/an/an/an/an/a
Wyeth Research
Curated by ChEMBL
Assay Description
Displacement of [3H]-LSD from cloned human 5-HT6 receptor expressed in human HeLa cells
Bioorg Med Chem 19: 650-62 (2011)
Article DOI: 10.1016/j.bmc.2010.10.033
BindingDB Entry DOI: 10.7270/Q29S1R9V
5-hydroxytryptamine receptor 6
(Homo sapiens (Human))
BDBM50334757
(CHEMBL1642887 | N-(Piperidin-4-yl)-3-(4-(trifluoro...)
Show SMILES FC(F)(F)c1ccc(cc1)S(=O)(=O)c1n[nH]c2ccc(NC3CCNCC3)cc12
Show InChI InChI=1S/C19H19F3N4O2S/c20-19(21,22)12-1-4-15(5-2-12)29(27,28)18-16-11-14(3-6-17(16)25-26-18)24-13-7-9-23-10-8-13/h1-6,11,13,23-24H,7-10H2,(H,25,26)
Reactome pathway
n/an/a 27n/an/an/an/an/an/a
Wyeth Research
Curated by ChEMBL
Assay Description
Antagonist activity at cloned human 5-HT6 receptor expressed in human HeLa cells assessed as inhibition of 5HT-induced cyclic AMP formation
Bioorg Med Chem 19: 650-62 (2011)
Article DOI: 10.1016/j.bmc.2010.10.033
BindingDB Entry DOI: 10.7270/Q29S1R9V