BDBM50334918 (R)-1-(3,4-dichlorophenyl)-1,2,3,4-tetrahydroquinolin-4-amine::CHEMBL1643512
SMILES: N[C@@H]1CCN(c2ccc(Cl)c(Cl)c2)c2ccccc12
InChI Key: InChIKey=OBKCQTGBMZHBFE-CQSZACIVSA-N
Data: 8 IC50
Activity Spreadsheet -- Enzyme Inhibition Constant Data from BindingDB
Found 8 hits for monomerid = 50334918
Trg + Lig
Ki
nM
ΔG°
kcal/mole
IC50
nM
Kd
nM
EC50/IC50
nM
koff
s-1
kon
M-1s-1
pHTemp
°C
Sodium-dependent serotonin transporter
(Homo sapiens (Human))
BDBM50334918
((R)-1-(3,4-dichlorophenyl)-1,2,3,4-tetrahydroquino...)
Show SMILES N[C@@H]1CCN(c2ccc(Cl)c(Cl)c2)c2ccccc12 |r|
Show InChI InChI=1S/C15H14Cl2N2/c16-12-6-5-10(9-13(12)17)19-8-7-14(18)11-3-1-2-4-15(11)19/h1-6,9,14H,7-8,18H2/t14-/m1/s1
n/an/a 116n/an/an/an/an/an/a
Sunovion Pharmaceuticals Inc
Curated by ChEMBL
Assay Description
Inhibition of human recombinant 5HT transporter
Bioorg Med Chem Lett 21: 520-3 (2010)
Article DOI: 10.1016/j.bmcl.2010.10.086
BindingDB Entry DOI: 10.7270/Q2DJ5FWS
Sodium-dependent noradrenaline transporter
(Homo sapiens (Human))
BDBM50334918
((R)-1-(3,4-dichlorophenyl)-1,2,3,4-tetrahydroquino...)
Show SMILES N[C@@H]1CCN(c2ccc(Cl)c(Cl)c2)c2ccccc12 |r|
Show InChI InChI=1S/C15H14Cl2N2/c16-12-6-5-10(9-13(12)17)19-8-7-14(18)11-3-1-2-4-15(11)19/h1-6,9,14H,7-8,18H2/t14-/m1/s1
Reactome pathway
n/an/a 138n/an/an/an/an/an/a
Sunovion Pharmaceuticals Inc
Curated by ChEMBL
Assay Description
Inhibition of human recombinant norepinephrine transporter
Bioorg Med Chem Lett 21: 520-3 (2010)
Article DOI: 10.1016/j.bmcl.2010.10.086
BindingDB Entry DOI: 10.7270/Q2DJ5FWS
Sodium-dependent dopamine transporter
(Homo sapiens (Human))
BDBM50334918
((R)-1-(3,4-dichlorophenyl)-1,2,3,4-tetrahydroquino...)
Show SMILES N[C@@H]1CCN(c2ccc(Cl)c(Cl)c2)c2ccccc12 |r|
Show InChI InChI=1S/C15H14Cl2N2/c16-12-6-5-10(9-13(12)17)19-8-7-14(18)11-3-1-2-4-15(11)19/h1-6,9,14H,7-8,18H2/t14-/m1/s1
NCI pathway
Reactome pathway
n/an/a 12n/an/an/an/an/an/a
Sunovion Pharmaceuticals Inc
Curated by ChEMBL
Assay Description
Inhibition of human recombinant dopamine transporter
Bioorg Med Chem Lett 21: 520-3 (2010)
Article DOI: 10.1016/j.bmcl.2010.10.086
BindingDB Entry DOI: 10.7270/Q2DJ5FWS
Potassium voltage-gated channel subfamily H member 2
(Homo sapiens (Human))
BDBM50334918
((R)-1-(3,4-dichlorophenyl)-1,2,3,4-tetrahydroquino...)
Show SMILES N[C@@H]1CCN(c2ccc(Cl)c(Cl)c2)c2ccccc12 |r|
Show InChI InChI=1S/C15H14Cl2N2/c16-12-6-5-10(9-13(12)17)19-8-7-14(18)11-3-1-2-4-15(11)19/h1-6,9,14H,7-8,18H2/t14-/m1/s1
Reactome pathway
n/an/a 3.50E+3n/an/an/an/an/an/a
Sunovion Pharmaceuticals Inc
Curated by ChEMBL
Assay Description
Inhibition of human ERG
Bioorg Med Chem Lett 21: 520-3 (2010)
Article DOI: 10.1016/j.bmcl.2010.10.086
BindingDB Entry DOI: 10.7270/Q2DJ5FWS
Cytochrome P450 2C19
(Homo sapiens (Human))
BDBM50334918
((R)-1-(3,4-dichlorophenyl)-1,2,3,4-tetrahydroquino...)
Show SMILES N[C@@H]1CCN(c2ccc(Cl)c(Cl)c2)c2ccccc12 |r|
Show InChI InChI=1S/C15H14Cl2N2/c16-12-6-5-10(9-13(12)17)19-8-7-14(18)11-3-1-2-4-15(11)19/h1-6,9,14H,7-8,18H2/t14-/m1/s1
Reactome pathway
n/an/a>2.50E+4n/an/an/an/an/an/a
Sunovion Pharmaceuticals Inc
Curated by ChEMBL
Assay Description
Inhibition of CYP2C19
Bioorg Med Chem Lett 21: 520-3 (2010)
Article DOI: 10.1016/j.bmcl.2010.10.086
BindingDB Entry DOI: 10.7270/Q2DJ5FWS
Cytochrome P450 2D6
(Homo sapiens (Human))
BDBM50334918
((R)-1-(3,4-dichlorophenyl)-1,2,3,4-tetrahydroquino...)
Show SMILES N[C@@H]1CCN(c2ccc(Cl)c(Cl)c2)c2ccccc12 |r|
Show InChI InChI=1S/C15H14Cl2N2/c16-12-6-5-10(9-13(12)17)19-8-7-14(18)11-3-1-2-4-15(11)19/h1-6,9,14H,7-8,18H2/t14-/m1/s1
n/an/a 4.87E+3n/an/an/an/an/an/a
Sunovion Pharmaceuticals Inc
Curated by ChEMBL
Assay Description
Inhibition of CYP2D6
Bioorg Med Chem Lett 21: 520-3 (2010)
Article DOI: 10.1016/j.bmcl.2010.10.086
BindingDB Entry DOI: 10.7270/Q2DJ5FWS
Cytochrome P450 3A4
(Homo sapiens (Human))
BDBM50334918
((R)-1-(3,4-dichlorophenyl)-1,2,3,4-tetrahydroquino...)
Show SMILES N[C@@H]1CCN(c2ccc(Cl)c(Cl)c2)c2ccccc12 |r|
Show InChI InChI=1S/C15H14Cl2N2/c16-12-6-5-10(9-13(12)17)19-8-7-14(18)11-3-1-2-4-15(11)19/h1-6,9,14H,7-8,18H2/t14-/m1/s1
Reactome pathway
n/an/a>2.50E+4n/an/an/an/an/an/a
Sunovion Pharmaceuticals Inc
Curated by ChEMBL
Assay Description
Inhibition of CYP3A4
Bioorg Med Chem Lett 21: 520-3 (2010)
Article DOI: 10.1016/j.bmcl.2010.10.086
BindingDB Entry DOI: 10.7270/Q2DJ5FWS
Cytochrome P450 2C9
(Homo sapiens (Human))
BDBM50334918
((R)-1-(3,4-dichlorophenyl)-1,2,3,4-tetrahydroquino...)
Show SMILES N[C@@H]1CCN(c2ccc(Cl)c(Cl)c2)c2ccccc12 |r|
Show InChI InChI=1S/C15H14Cl2N2/c16-12-6-5-10(9-13(12)17)19-8-7-14(18)11-3-1-2-4-15(11)19/h1-6,9,14H,7-8,18H2/t14-/m1/s1
Reactome pathway
n/an/a>2.50E+4n/an/an/an/an/an/a
Sunovion Pharmaceuticals Inc
Curated by ChEMBL
Assay Description
Inhibition of CYP2C9
Bioorg Med Chem Lett 21: 520-3 (2010)
Article DOI: 10.1016/j.bmcl.2010.10.086
BindingDB Entry DOI: 10.7270/Q2DJ5FWS