null
SMILES: CCCCOC(=O)Nc1cc2nc([nH]c2cc1N(CC)CC)C1CCCCC1
InChI Key: InChIKey=ZURYXKJPYBCOQQ-UHFFFAOYSA-N
Activity Spreadsheet -- Enzyme Inhibition Constant Data from BindingDB
Found 1 hit for monomerid = 50335239
Trg + Lig
Ki
nM
ΔG°
kcal/mole
IC50
nM
Kd
nM
EC50/IC50
nM
koff
s-1
kon
M-1s-1
pHTemp
°C
Cell division protein FtsZ
(Mycobacterium tuberculosis)
BDBM50335239
(CHEMBL1651202 | butyl 2-cyclohexyl-6-(diethylamino...)
Show SMILES CCCCOC(=O)Nc1cc2nc([nH]c2cc1N(CC)CC)C1CCCCC1
Show InChI InChI=1S/C22H34N4O2/c1-4-7-13-28-22(27)25-19-14-17-18(15-20(19)26(5-2)6-3)24-21(23-17)16-11-9-8-10-12-16/h14-16H,4-13H2,1-3H3,(H,23,24)(H,25,27)
n/an/a 7.69E+3n/an/an/an/an/an/a
State University of New York
Curated by ChEMBL
Assay Description
Inhibition of Mycobacterium tuberculosis FtsZ polymerization
J Med Chem 54: 374-81 (2011)
Article DOI: 10.1021/jm1012006
BindingDB Entry DOI: 10.7270/Q26W9C29