BDBM50335290 CHEMBL1651362::N-{4-[5-(2-Thienyl)-1,2,4-oxadiazol-3-yl]benzoyl}-N-methylleucyl-methylazalanine-nitrile
SMILES: CC(C)C[C@H](N(C)C(=O)c1ccc(cc1)-c1noc(n1)-c1cccs1)C(=O)N(C)N(C)C#N
InChI Key: InChIKey=VQKRNTTUZDCHOZ-SFHVURJKSA-N
Data: 4 KI
Activity Spreadsheet -- Enzyme Inhibition Constant Data from BindingDB
Found 5 hits for monomerid = 50335290
Trg + Lig
Ki
nM
ΔG°
kcal/mole
IC50
nM
Kd
nM
EC50/IC50
nM
koff
s-1
kon
M-1s-1
pHTemp
°C
Cathepsin K
(Homo sapiens (Human))
BDBM50335290
(CHEMBL1651362 | N-{4-[5-(2-Thienyl)-1,2,4-oxadiazo...)
Show SMILES CC(C)C[C@H](N(C)C(=O)c1ccc(cc1)-c1noc(n1)-c1cccs1)C(=O)N(C)N(C)C#N |r|
Show InChI InChI=1S/C23H26N6O3S/c1-15(2)13-18(23(31)29(5)27(3)14-24)28(4)22(30)17-10-8-16(9-11-17)20-25-21(32-26-20)19-7-6-12-33-19/h6-12,15,18H,13H2,1-5H3/t18-/m0/s1
Reactome pathway
0.630n/an/an/an/an/an/an/an/a
University of Bonn
Curated by ChEMBL
Assay Description
Inhibition of human recombinant cathepsin K after 30 mins by spectrophotometric assay
J Med Chem 54: 396-400 (2011)
Article DOI: 10.1021/jm101272p
BindingDB Entry DOI: 10.7270/Q2PV6MC3
Cathepsin S
(Homo sapiens (Human))
BDBM50335290
(CHEMBL1651362 | N-{4-[5-(2-Thienyl)-1,2,4-oxadiazo...)
Show SMILES CC(C)C[C@H](N(C)C(=O)c1ccc(cc1)-c1noc(n1)-c1cccs1)C(=O)N(C)N(C)C#N |r|
Show InChI InChI=1S/C23H26N6O3S/c1-15(2)13-18(23(31)29(5)27(3)14-24)28(4)22(30)17-10-8-16(9-11-17)20-25-21(32-26-20)19-7-6-12-33-19/h6-12,15,18H,13H2,1-5H3/t18-/m0/s1
Reactome pathway
140n/an/an/an/an/an/an/an/a
University of Bonn
Curated by ChEMBL
Assay Description
Inhibition of human cathepsin S after 30 mins by spectrophotometric assay
J Med Chem 54: 396-400 (2011)
Article DOI: 10.1021/jm101272p
BindingDB Entry DOI: 10.7270/Q2PV6MC3
Cathepsin B
(Homo sapiens (Human))
BDBM50335290
(CHEMBL1651362 | N-{4-[5-(2-Thienyl)-1,2,4-oxadiazo...)
Show SMILES CC(C)C[C@H](N(C)C(=O)c1ccc(cc1)-c1noc(n1)-c1cccs1)C(=O)N(C)N(C)C#N |r|
Show InChI InChI=1S/C23H26N6O3S/c1-15(2)13-18(23(31)29(5)27(3)14-24)28(4)22(30)17-10-8-16(9-11-17)20-25-21(32-26-20)19-7-6-12-33-19/h6-12,15,18H,13H2,1-5H3/t18-/m0/s1
Reactome pathway
510n/an/an/an/an/an/an/an/a
University of Bonn
Curated by ChEMBL
Assay Description
Inhibition of human recombinant cathepsin B after 30 mins by spectrophotometric assay
J Med Chem 54: 396-400 (2011)
Article DOI: 10.1021/jm101272p
BindingDB Entry DOI: 10.7270/Q2PV6MC3
Procathepsin L
(Homo sapiens (Human))
BDBM50335290
(CHEMBL1651362 | N-{4-[5-(2-Thienyl)-1,2,4-oxadiazo...)
Show SMILES CC(C)C[C@H](N(C)C(=O)c1ccc(cc1)-c1noc(n1)-c1cccs1)C(=O)N(C)N(C)C#N |r|
Show InChI InChI=1S/C23H26N6O3S/c1-15(2)13-18(23(31)29(5)27(3)14-24)28(4)22(30)17-10-8-16(9-11-17)20-25-21(32-26-20)19-7-6-12-33-19/h6-12,15,18H,13H2,1-5H3/t18-/m0/s1
Reactome pathway
2.70E+3n/an/an/an/an/an/an/an/a
University of Bonn
Curated by ChEMBL
Assay Description
Inhibition of human recombinant cathepsin L after 30 mins by spectrophotometric assay
J Med Chem 54: 396-400 (2011)
Article DOI: 10.1021/jm101272p
BindingDB Entry DOI: 10.7270/Q2PV6MC3
Replicase polyprotein 1ab
(2019-nCoV)
BDBM50335290
(CHEMBL1651362 | N-{4-[5-(2-Thienyl)-1,2,4-oxadiazo...)
Show SMILES CC(C)C[C@H](N(C)C(=O)c1ccc(cc1)-c1noc(n1)-c1cccs1)C(=O)N(C)N(C)C#N |r|
Show InChI InChI=1S/C23H26N6O3S/c1-15(2)13-18(23(31)29(5)27(3)14-24)28(4)22(30)17-10-8-16(9-11-17)20-25-21(32-26-20)19-7-6-12-33-19/h6-12,15,18H,13H2,1-5H3/t18-/m0/s1
NCI pathway
Reactome pathway
n/an/a 5.54E+3n/an/an/an/an/an/a
TBA
Citation and Details