BDBM50335466 1-(4-(5-butoxybenzofuran-2-yl)-3-chlorobenzyl)azetidine-3-carboxylic acid::CHEMBL1651714
SMILES: CCCCOc1ccc2oc(cc2c1)-c1ccc(CN2CC(C2)C(O)=O)cc1Cl
InChI Key: InChIKey=KAEUWGJEROCSNU-UHFFFAOYSA-N
Data: 2 EC50
Activity Spreadsheet -- Enzyme Inhibition Constant Data from BindingDB
Found 2 hits for monomerid = 50335466
Trg + Lig
Ki
nM
ΔG°
kcal/mole
IC50
nM
Kd
nM
EC50/IC50
nM
koff
s-1
kon
M-1s-1
pHTemp
°C
Sphingosine 1-phosphate receptor 3
(Homo sapiens (Human))
BDBM50335466
(1-(4-(5-butoxybenzofuran-2-yl)-3-chlorobenzyl)azet...)
Show SMILES CCCCOc1ccc2oc(cc2c1)-c1ccc(CN2CC(C2)C(O)=O)cc1Cl
Show InChI InChI=1S/C23H24ClNO4/c1-2-3-8-28-18-5-7-21-16(10-18)11-22(29-21)19-6-4-15(9-20(19)24)12-25-13-17(14-25)23(26)27/h4-7,9-11,17H,2-3,8,12-14H2,1H3,(H,26,27)
NCI pathway
Reactome pathway
n/an/an/an/a 1.03E+4n/an/an/an/a
TBA
Curated by ChEMBL
Assay Description
Agonist activity at human S1P3R expressed in CHO cells by Ca(2+) mobilization assay
ACS Med Chem Lett 2: 97-101 (2011)
Article DOI: 10.1021/ml100227q
BindingDB Entry DOI: 10.7270/Q2WM1DP6
Sphingosine 1-phosphate receptor 1
(Homo sapiens (Human))
BDBM50335466
(1-(4-(5-butoxybenzofuran-2-yl)-3-chlorobenzyl)azet...)
Show SMILES CCCCOc1ccc2oc(cc2c1)-c1ccc(CN2CC(C2)C(O)=O)cc1Cl
Show InChI InChI=1S/C23H24ClNO4/c1-2-3-8-28-18-5-7-21-16(10-18)11-22(29-21)19-6-4-15(9-20(19)24)12-25-13-17(14-25)23(26)27/h4-7,9-11,17H,2-3,8,12-14H2,1H3,(H,26,27)
Reactome pathway
n/an/an/an/a 158n/an/an/an/a
TBA
Curated by ChEMBL
Assay Description
Induction of human GFP-tagged chimeric S1P1R internalization in human U2Os cells by fluorescence microscopy
ACS Med Chem Lett 2: 97-101 (2011)
Article DOI: 10.1021/ml100227q
BindingDB Entry DOI: 10.7270/Q2WM1DP6