null
SMILES: Nc1nc(NC2CC2)c2ncn(CCOCP(O)(=O)OP(O)(O)=O)c2n1
InChI Key: InChIKey=RAGKALDUAYWVMO-UHFFFAOYSA-N
Activity Spreadsheet -- Enzyme Inhibition Constant Data from BindingDB
Found 2 hits for monomerid = 50335555
Trg + Lig
Ki
nM
ΔG°
kcal/mole
IC50
nM
Kd
nM
EC50/IC50
nM
koff
s-1
kon
M-1s-1
pHTemp
°C
DNA polymerase beta
(Homo sapiens (Human))
BDBM50335555
(CHEMBL1652468 | {[({2-[2-amino-6-(cyclopropylamino...)
Show SMILES Nc1nc(NC2CC2)c2ncn(CCOCP(O)(=O)OP(O)(O)=O)c2n1
Show InChI InChI=1S/C11H18N6O7P2/c12-11-15-9(14-7-1-2-7)8-10(16-11)17(5-13-8)3-4-23-6-25(18,19)24-26(20,21)22/h5,7H,1-4,6H2,(H,18,19)(H2,20,21,22)(H3,12,14,15,16)
Reactome pathway
n/an/a 3.30E+4n/an/an/an/an/an/a
USA.
Curated by ChEMBL
Assay Description
Inhibition of human DNA polymerase beta by microplate reader analysis
Antimicrob Agents Chemother 53: 2777-84 (2009)
Article DOI: 10.1128/AAC.00103-09
BindingDB Entry DOI: 10.7270/Q2M32W2N
DNA polymerase alpha catalytic subunit
(Homo sapiens (Human))
BDBM50335555
(CHEMBL1652468 | {[({2-[2-amino-6-(cyclopropylamino...)
Show SMILES Nc1nc(NC2CC2)c2ncn(CCOCP(O)(=O)OP(O)(O)=O)c2n1
Show InChI InChI=1S/C11H18N6O7P2/c12-11-15-9(14-7-1-2-7)8-10(16-11)17(5-13-8)3-4-23-6-25(18,19)24-26(20,21)22/h5,7H,1-4,6H2,(H,18,19)(H2,20,21,22)(H3,12,14,15,16)
NCI pathway
Reactome pathway
n/an/a>1.00E+5n/an/an/an/an/an/a
USA.
Curated by ChEMBL
Assay Description
Inhibition of human DNA polymerase alpha by microplate reader analysis
Antimicrob Agents Chemother 53: 2777-84 (2009)
Article DOI: 10.1128/AAC.00103-09
BindingDB Entry DOI: 10.7270/Q2M32W2N