BDBM50336261 4-(4-hydroxy-3-methoxybenzylidene)-1,7-bis(4-hydroxy-3-methoxyphenyl)hepta-1,6-diene-3,5-dione::CHEMBL428441
SMILES: [#6]-[#8]-c1cc(\[#6]=[#6]\[#6](=O)-[#6](=[#6]/c2ccc(-[#8])c(-[#8]-[#6])c2)\[#6](=O)\[#6]=[#6]\c2ccc(-[#8])c(-[#8]-[#6])c2)ccc1-[#8]
InChI Key: InChIKey=UBAXBJGMRVTJRB-LUZURFALSA-N
Data: 1 KI  4 IC50
Activity Spreadsheet -- Enzyme Inhibition Constant Data from BindingDB
Found 5 hits for monomerid = 50336261
Trg + Lig
Ki
nM
ΔG°
kcal/mole
IC50
nM
Kd
nM
EC50/IC50
nM
koff
s-1
kon
M-1s-1
pHTemp
°C
Glyoxalase 1 (GLO1)
(Homo sapiens (Human))
BDBM50336261
(4-(4-hydroxy-3-methoxybenzylidene)-1,7-bis(4-hydro...)
Show SMILES [#6]-[#8]-c1cc(\[#6]=[#6]\[#6](=O)-[#6](=[#6]/c2ccc(-[#8])c(-[#8]-[#6])c2)\[#6](=O)\[#6]=[#6]\c2ccc(-[#8])c(-[#8]-[#6])c2)ccc1-[#8]
Show InChI InChI=1S/C29H26O8/c1-35-27-15-18(6-11-24(27)32)4-9-22(30)21(14-20-8-13-26(34)29(17-20)37-3)23(31)10-5-19-7-12-25(33)28(16-19)36-2/h4-17,32-34H,1-3H3/b9-4+,10-5+
3.60E+3n/an/an/an/an/an/an/an/a
Sun Yat-sen University
Curated by ChEMBL
Assay Description
Inhibition of human recombinant His-tagged glyoxalase 1 expressed in Escherichia coli BL21 (DE3) preincubated for 20 mins by Dixon plot analysis
Bioorg Med Chem 19: 1189-96 (2011)
Article DOI: 10.1016/j.bmc.2010.12.039
BindingDB Entry DOI: 10.7270/Q2222V2X
Tyrosine-protein kinase ABL1
(Homo sapiens (Human))
BDBM50336261
(4-(4-hydroxy-3-methoxybenzylidene)-1,7-bis(4-hydro...)
Show SMILES [#6]-[#8]-c1cc(\[#6]=[#6]\[#6](=O)-[#6](=[#6]/c2ccc(-[#8])c(-[#8]-[#6])c2)\[#6](=O)\[#6]=[#6]\c2ccc(-[#8])c(-[#8]-[#6])c2)ccc1-[#8]
Show InChI InChI=1S/C29H26O8/c1-35-27-15-18(6-11-24(27)32)4-9-22(30)21(14-20-8-13-26(34)29(17-20)37-3)23(31)10-5-19-7-12-25(33)28(16-19)36-2/h4-17,32-34H,1-3H3/b9-4+,10-5+
Reactome pathway
n/an/a 83n/an/an/an/an/an/a
Manipal Academy of Higher Education
Curated by ChEMBL
Assay Description
Inhibition of Wild type ABL (unknown origin)
Eur J Med Chem 177: 76-104 (2019)
Article DOI: 10.1016/j.ejmech.2019.04.058
Tyrosine-protein kinase ABL1
(Homo sapiens (Human))
BDBM50336261
(4-(4-hydroxy-3-methoxybenzylidene)-1,7-bis(4-hydro...)
Show SMILES [#6]-[#8]-c1cc(\[#6]=[#6]\[#6](=O)-[#6](=[#6]/c2ccc(-[#8])c(-[#8]-[#6])c2)\[#6](=O)\[#6]=[#6]\c2ccc(-[#8])c(-[#8]-[#6])c2)ccc1-[#8]
Show InChI InChI=1S/C29H26O8/c1-35-27-15-18(6-11-24(27)32)4-9-22(30)21(14-20-8-13-26(34)29(17-20)37-3)23(31)10-5-19-7-12-25(33)28(16-19)36-2/h4-17,32-34H,1-3H3/b9-4+,10-5+
Reactome pathway
n/an/a 67n/an/an/an/an/an/a
Manipal Academy of Higher Education
Curated by ChEMBL
Assay Description
Inhibition of ABL T315I mutant (unknown origin)
Eur J Med Chem 177: 76-104 (2019)
Article DOI: 10.1016/j.ejmech.2019.04.058
Tyrosine-protein kinase ABL1
(Homo sapiens (Human))
BDBM50336261
(4-(4-hydroxy-3-methoxybenzylidene)-1,7-bis(4-hydro...)
Show SMILES [#6]-[#8]-c1cc(\[#6]=[#6]\[#6](=O)-[#6](=[#6]/c2ccc(-[#8])c(-[#8]-[#6])c2)\[#6](=O)\[#6]=[#6]\c2ccc(-[#8])c(-[#8]-[#6])c2)ccc1-[#8]
Show InChI InChI=1S/C29H26O8/c1-35-27-15-18(6-11-24(27)32)4-9-22(30)21(14-20-8-13-26(34)29(17-20)37-3)23(31)10-5-19-7-12-25(33)28(16-19)36-2/h4-17,32-34H,1-3H3/b9-4+,10-5+
Reactome pathway
n/an/a 185n/an/an/an/an/an/a
Manipal Academy of Higher Education
Curated by ChEMBL
Assay Description
Inhibition of ABL Q252H mutant (unknown origin)
Eur J Med Chem 177: 76-104 (2019)
Article DOI: 10.1016/j.ejmech.2019.04.058
Tyrosine-protein kinase ABL1
(Homo sapiens (Human))
BDBM50336261
(4-(4-hydroxy-3-methoxybenzylidene)-1,7-bis(4-hydro...)
Show SMILES [#6]-[#8]-c1cc(\[#6]=[#6]\[#6](=O)-[#6](=[#6]/c2ccc(-[#8])c(-[#8]-[#6])c2)\[#6](=O)\[#6]=[#6]\c2ccc(-[#8])c(-[#8]-[#6])c2)ccc1-[#8]
Show InChI InChI=1S/C29H26O8/c1-35-27-15-18(6-11-24(27)32)4-9-22(30)21(14-20-8-13-26(34)29(17-20)37-3)23(31)10-5-19-7-12-25(33)28(16-19)36-2/h4-17,32-34H,1-3H3/b9-4+,10-5+
Reactome pathway
n/an/a 80n/an/an/an/an/an/a
Manipal Academy of Higher Education
Curated by ChEMBL
Assay Description
Inhibition of ABL Y253F mutant (unknown origin)
Eur J Med Chem 177: 76-104 (2019)
Article DOI: 10.1016/j.ejmech.2019.04.058