BDBM50336277 1-oxo-3,4,5,6,7,8,9,10-octahydro-1H-benzo[c][1]oxacyclododecine-12,14-diyl diacetate::CHEMBL1669772
SMILES: CC(=O)Oc1cc2CCCCCCCCOC(=O)c2c(OC(C)=O)c1
InChI Key: InChIKey=OPYUMOYXDATHNQ-UHFFFAOYSA-N
Data: 1 IC50
Activity Spreadsheet -- Enzyme Inhibition Constant Data from BindingDB
Found 1 hit for monomerid = 50336277
Trg + Lig
Ki
nM
ΔG°
kcal/mole
IC50
nM
Kd
nM
EC50/IC50
nM
koff
s-1
kon
M-1s-1
pHTemp
°C
Mineralocorticoid receptor
(RAT)
BDBM50336277
(1-oxo-3,4,5,6,7,8,9,10-octahydro-1H-benzo[c][1]oxa...)
Show SMILES CC(=O)Oc1cc2CCCCCCCCOC(=O)c2c(OC(C)=O)c1
Show InChI InChI=1S/C19H24O6/c1-13(20)24-16-11-15-9-7-5-3-4-6-8-10-23-19(22)18(15)17(12-16)25-14(2)21/h11-12H,3-10H2,1-2H3
n/an/a 1.11E+3n/an/an/an/an/an/a
Chinese Academy of Sciences
Curated by ChEMBL
Assay Description
Antagonist activity at rat mineralocorticoid receptor-ligand binding domain expressed in AH109 yeast cells co expressing pGADT7-hSRC-1 by two hybrid ...
Bioorg Med Chem Lett 21: 1171-5 (2011)
Article DOI: 10.1016/j.bmcl.2010.12.101
BindingDB Entry DOI: 10.7270/Q2X92BKM