BDBM50336318 CHEMBL1667936::trans-2-(3-(-4-ethylcyclohexyl)-7-methyl-3aH-inden-1-yl)-1-methyl-7-phenylnaphthalene
SMILES: Nc1nccn2c(nc(-c3ccc4ccc(nc4c3F)-c3ccccc3)c12)[C@H]1CC[C@H](CO)CC1
InChI Key: InChIKey=DBVAFYOHTCCGQW-IRJFHVNHSA-N
Data: 1 IC50
Activity Spreadsheet -- Enzyme Inhibition Constant Data from BindingDB
Found 1 hit for monomerid = 50336318
Trg + Lig
Ki
nM
ΔG°
kcal/mole
IC50
nM
Kd
nM
EC50/IC50
nM
koff
s-1
kon
M-1s-1
pHTemp
°C
Insulin-like growth factor 1 receptor
(Homo sapiens (Human))
BDBM50336318
(CHEMBL1667936 | trans-2-(3-(-4-ethylcyclohexyl)-7-...)
Show SMILES Nc1nccn2c(nc(-c3ccc4ccc(nc4c3F)-c3ccccc3)c12)[C@H]1CC[C@H](CO)CC1 |r,wU:27.31,wD:30.35,(3.1,-15.73,;3.11,-17.27,;1.78,-18.04,;1.78,-19.59,;3.11,-20.36,;4.45,-19.58,;5.92,-20.05,;6.82,-18.8,;5.91,-17.55,;6.68,-16.23,;5.91,-14.9,;6.67,-13.57,;8.22,-13.56,;8.98,-12.24,;10.51,-12.24,;11.29,-13.57,;10.52,-14.9,;8.99,-14.89,;8.22,-16.23,;8.99,-17.57,;12.82,-13.57,;13.59,-14.91,;15.13,-14.91,;15.9,-13.57,;15.12,-12.23,;13.58,-12.24,;4.44,-18.04,;6.41,-21.51,;7.91,-21.81,;8.39,-23.28,;7.36,-24.43,;7.84,-25.89,;9.35,-26.21,;5.86,-24.11,;5.38,-22.65,)|
Show InChI InChI=1S/C28H26FN5O/c29-23-21(12-10-19-11-13-22(32-24(19)23)18-4-2-1-3-5-18)25-26-27(30)31-14-15-34(26)28(33-25)20-8-6-17(16-35)7-9-20/h1-5,10-15,17,20,35H,6-9,16H2,(H2,30,31)/t17-,20-
Reactome pathway
n/an/a 8n/an/an/an/an/an/a
OSI Pharmaceuticals, Inc.
Curated by ChEMBL
Assay Description
Inhibition of human IGF1R expressed in mouse 3T3 cells by ELISA based assay
Bioorg Med Chem Lett 21: 1176-80 (2011)
Article DOI: 10.1016/j.bmcl.2010.12.094
BindingDB Entry DOI: 10.7270/Q2J103DJ