BDBM50336473 CHEMBL1668494::N1-cyclohexyl-N4-(4-methyl-2-(pyrrolidin-1-yl)quinolin-6-yl)succinamide
SMILES: Cc1cc(nc2ccc(NC(=O)CCC(=O)NC3CCCCC3)cc12)N1CCCC1
InChI Key: InChIKey=IHRCROXXMJNPBO-UHFFFAOYSA-N
Data: 1 IC50
Activity Spreadsheet -- Enzyme Inhibition Constant Data from BindingDB
Found 1 hit for monomerid = 50336473
Trg + Lig
Ki
nM
ΔG°
kcal/mole
IC50
nM
Kd
nM
EC50/IC50
nM
koff
s-1
kon
M-1s-1
pHTemp
°C
Acetylcholinesterase
(Electrophorus electricus (Electric eel))
BDBM50336473
(CHEMBL1668494 | N1-cyclohexyl-N4-(4-methyl-2-(pyrr...)
Show SMILES Cc1cc(nc2ccc(NC(=O)CCC(=O)NC3CCCCC3)cc12)N1CCCC1
Show InChI InChI=1S/C24H32N4O2/c1-17-15-22(28-13-5-6-14-28)27-21-10-9-19(16-20(17)21)26-24(30)12-11-23(29)25-18-7-3-2-4-8-18/h9-10,15-16,18H,2-8,11-14H2,1H3,(H,25,29)(H,26,30)
n/an/a 1.00E+3n/an/an/an/an/an/a
National Institute of Pharmaceutical Education and Research (NIPER)
Curated by ChEMBL
Assay Description
Inhibition of electric eel AChE by Ellman's method
Bioorg Med Chem Lett 21: 1105-12 (2011)
Article DOI: 10.1016/j.bmcl.2010.12.131
BindingDB Entry DOI: 10.7270/Q2V988B9