BDBM50336477 1,3,5-trihydroxy-4-methoxy-10-methyl-2,8-bis(3-methylbut-2-enyl)acridin-9(10H)-one::CHEMBL1668597
SMILES: [#6]-[#8]-c1c(-[#8])c(-[#6]\[#6]=[#6](/[#6])-[#6])c(-[#8])c2c1n(-[#6])c1c(-[#8])ccc(-[#6]\[#6]=[#6](\[#6])-[#6])c1c2=O
InChI Key: InChIKey=LICNIJQEAUQKSD-UHFFFAOYSA-N
Data: 1 KI  1 IC50
Activity Spreadsheet -- Enzyme Inhibition Constant Data from BindingDB
Found 2 hits for monomerid = 50336477
Trg + Lig
Ki
nM
ΔG°
kcal/mole
IC50
nM
Kd
nM
EC50/IC50
nM
koff
s-1
kon
M-1s-1
pHTemp
°C
Cathepsin L2
(Homo sapiens (Human))
BDBM50336477
(1,3,5-trihydroxy-4-methoxy-10-methyl-2,8-bis(3-met...)
Show SMILES [#6]-[#8]-c1c(-[#8])c(-[#6]\[#6]=[#6](/[#6])-[#6])c(-[#8])c2c1n(-[#6])c1c(-[#8])ccc(-[#6]\[#6]=[#6](\[#6])-[#6])c1c2=O
Show InChI InChI=1S/C25H29NO5/c1-13(2)7-9-15-10-12-17(27)20-18(15)24(30)19-21(26(20)5)25(31-6)23(29)16(22(19)28)11-8-14(3)4/h7-8,10,12,27-29H,9,11H2,1-6H3
500n/an/an/an/an/an/an/an/a
Universidade Federal de S£o Carlos
Curated by ChEMBL
Assay Description
Inhibition of human recombinant cathepsin V expressed in Pichia pastoris by Lineweaver-Burk double-reciprocal plots
Bioorg Med Chem 19: 1477-81 (2011)
Article DOI: 10.1016/j.bmc.2010.12.056
BindingDB Entry DOI: 10.7270/Q2QJ7HK4
Cathepsin L2
(Homo sapiens (Human))
BDBM50336477
(1,3,5-trihydroxy-4-methoxy-10-methyl-2,8-bis(3-met...)
Show SMILES [#6]-[#8]-c1c(-[#8])c(-[#6]\[#6]=[#6](/[#6])-[#6])c(-[#8])c2c1n(-[#6])c1c(-[#8])ccc(-[#6]\[#6]=[#6](\[#6])-[#6])c1c2=O
Show InChI InChI=1S/C25H29NO5/c1-13(2)7-9-15-10-12-17(27)20-18(15)24(30)19-21(26(20)5)25(31-6)23(29)16(22(19)28)11-8-14(3)4/h7-8,10,12,27-29H,9,11H2,1-6H3
n/an/a 2.50E+3n/an/an/an/an/an/a
Universidade Federal de S£o Carlos
Curated by ChEMBL
Assay Description
Inhibition of human recombinant cathepsin V expressed in Pichia pastoris
Bioorg Med Chem 19: 1477-81 (2011)
Article DOI: 10.1016/j.bmc.2010.12.056
BindingDB Entry DOI: 10.7270/Q2QJ7HK4