BDBM50336938 1-((4-(5-(4-Chlorobenzyl)benzo[d]thiazol-2-yl)-3-fluorophenyl)methyl)azetidine-3-carboxylic acid::CHEMBL1672569
SMILES: OC(=O)C1CN(Cc2ccc(-c3nc4cc(Cc5ccc(Cl)cc5)ccc4s3)c(F)c2)C1
InChI Key: InChIKey=ALVDLBSIUOWXQF-UHFFFAOYSA-N
Data: 2 EC50
Activity Spreadsheet -- Enzyme Inhibition Constant Data from BindingDB
Found 2 hits for monomerid = 50336938
Trg + Lig
Ki
nM
ΔG°
kcal/mole
IC50
nM
Kd
nM
EC50/IC50
nM
koff
s-1
kon
M-1s-1
pHTemp
°C
Sphingosine 1-phosphate receptor 1
(Homo sapiens (Human))
BDBM50336938
(1-((4-(5-(4-Chlorobenzyl)benzo[d]thiazol-2-yl)-3-f...)
Show SMILES OC(=O)C1CN(Cc2ccc(-c3nc4cc(Cc5ccc(Cl)cc5)ccc4s3)c(F)c2)C1
Show InChI InChI=1S/C25H20ClFN2O2S/c26-19-5-1-15(2-6-19)9-16-4-8-23-22(11-16)28-24(32-23)20-7-3-17(10-21(20)27)12-29-13-18(14-29)25(30)31/h1-8,10-11,18H,9,12-14H2,(H,30,31)
Reactome pathway
n/an/an/an/a 159n/an/an/an/a
TBA
Curated by ChEMBL
Assay Description
Agonist activity at human S1P1 receptor expressed in human U2OS cells co-expressing eGFP assessed as receptor internalization after 1 hr
ACS Med Chem Lett 2: 102-106 (2011)
Article DOI: 10.1021/ml100228m
BindingDB Entry DOI: 10.7270/Q2T72HR9
Sphingosine 1-phosphate receptor 3
(Homo sapiens (Human))
BDBM50336938
(1-((4-(5-(4-Chlorobenzyl)benzo[d]thiazol-2-yl)-3-f...)
Show SMILES OC(=O)C1CN(Cc2ccc(-c3nc4cc(Cc5ccc(Cl)cc5)ccc4s3)c(F)c2)C1
Show InChI InChI=1S/C25H20ClFN2O2S/c26-19-5-1-15(2-6-19)9-16-4-8-23-22(11-16)28-24(32-23)20-7-3-17(10-21(20)27)12-29-13-18(14-29)25(30)31/h1-8,10-11,18H,9,12-14H2,(H,30,31)
NCI pathway
Reactome pathway
n/an/an/an/a>2.50E+4n/an/an/an/a
TBA
Curated by ChEMBL
Assay Description
Agonist activity at human S1P3 receptor expressed in CHO-K1 cells co-expressing Gq/i5 G-protein assessed as calcium mobilization by FLIPR assay
ACS Med Chem Lett 2: 102-106 (2011)
Article DOI: 10.1021/ml100228m
BindingDB Entry DOI: 10.7270/Q2T72HR9