BDBM50336942 1-(3-Fluoro-4-(5-(3-methylbenzyl)benzo[d]thiazol-2-yl)benzyl)azetidine-3-carboxylic acid::CHEMBL1672565
SMILES: Cc1cccc(Cc2ccc3sc(nc3c2)-c2ccc(CN3CC(C3)C(O)=O)cc2F)c1
InChI Key: InChIKey=TWSQVUDENPEVHA-UHFFFAOYSA-N
Data: 2 EC50
Activity Spreadsheet -- Enzyme Inhibition Constant Data from BindingDB
Found 2 hits for monomerid = 50336942
Trg + Lig
Ki
nM
ΔG°
kcal/mole
IC50
nM
Kd
nM
EC50/IC50
nM
koff
s-1
kon
M-1s-1
pHTemp
°C
Sphingosine 1-phosphate receptor 1
(Homo sapiens (Human))
BDBM50336942
(1-(3-Fluoro-4-(5-(3-methylbenzyl)benzo[d]thiazol-2...)
Show SMILES Cc1cccc(Cc2ccc3sc(nc3c2)-c2ccc(CN3CC(C3)C(O)=O)cc2F)c1
Show InChI InChI=1S/C26H23FN2O2S/c1-16-3-2-4-17(9-16)10-18-6-8-24-23(12-18)28-25(32-24)21-7-5-19(11-22(21)27)13-29-14-20(15-29)26(30)31/h2-9,11-12,20H,10,13-15H2,1H3,(H,30,31)
Reactome pathway
n/an/an/an/a 54n/an/an/an/a
TBA
Curated by ChEMBL
Assay Description
Agonist activity at human S1P1 receptor expressed in human U2OS cells co-expressing eGFP assessed as receptor internalization after 1 hr
ACS Med Chem Lett 2: 102-106 (2011)
Article DOI: 10.1021/ml100228m
BindingDB Entry DOI: 10.7270/Q2T72HR9
Sphingosine 1-phosphate receptor 3
(Homo sapiens (Human))
BDBM50336942
(1-(3-Fluoro-4-(5-(3-methylbenzyl)benzo[d]thiazol-2...)
Show SMILES Cc1cccc(Cc2ccc3sc(nc3c2)-c2ccc(CN3CC(C3)C(O)=O)cc2F)c1
Show InChI InChI=1S/C26H23FN2O2S/c1-16-3-2-4-17(9-16)10-18-6-8-24-23(12-18)28-25(32-24)21-7-5-19(11-22(21)27)13-29-14-20(15-29)26(30)31/h2-9,11-12,20H,10,13-15H2,1H3,(H,30,31)
NCI pathway
Reactome pathway
n/an/an/an/a>2.50E+3n/an/an/an/a
TBA
Curated by ChEMBL
Assay Description
Agonist activity at human S1P3 receptor expressed in CHO-K1 cells co-expressing Gq/i5 G-protein assessed as calcium mobilization by FLIPR assay
ACS Med Chem Lett 2: 102-106 (2011)
Article DOI: 10.1021/ml100228m
BindingDB Entry DOI: 10.7270/Q2T72HR9