BDBM50336947 1-(4-(6-Benzyl-2H-indazol-2-yl)-3-fluorobenzyl)azetidine-3-carboxylic acid::CHEMBL1672557
SMILES: OC(=O)C1CN(Cc2ccc(c(F)c2)-n2cc3ccc(Cc4ccccc4)cc3n2)C1
InChI Key: InChIKey=PTBDBLRCEHPRPZ-UHFFFAOYSA-N
Data: 2 EC50
Activity Spreadsheet -- Enzyme Inhibition Constant Data from BindingDB
Found 2 hits for monomerid = 50336947
Trg + Lig
Ki
nM
ΔG°
kcal/mole
IC50
nM
Kd
nM
EC50/IC50
nM
koff
s-1
kon
M-1s-1
pHTemp
°C
Sphingosine 1-phosphate receptor 1
(Homo sapiens (Human))
BDBM50336947
(1-(4-(6-Benzyl-2H-indazol-2-yl)-3-fluorobenzyl)aze...)
Show SMILES OC(=O)C1CN(Cc2ccc(c(F)c2)-n2cc3ccc(Cc4ccccc4)cc3n2)C1
Show InChI InChI=1S/C25H22FN3O2/c26-22-11-19(13-28-14-21(15-28)25(30)31)7-9-24(22)29-16-20-8-6-18(12-23(20)27-29)10-17-4-2-1-3-5-17/h1-9,11-12,16,21H,10,13-15H2,(H,30,31)
Reactome pathway
n/an/an/an/a 1.81E+3n/an/an/an/a
TBA
Curated by ChEMBL
Assay Description
Agonist activity at human S1P1 receptor expressed in human U2OS cells co-expressing eGFP assessed as receptor internalization after 1 hr
ACS Med Chem Lett 2: 102-106 (2011)
Article DOI: 10.1021/ml100228m
BindingDB Entry DOI: 10.7270/Q2T72HR9
Sphingosine 1-phosphate receptor 3
(Homo sapiens (Human))
BDBM50336947
(1-(4-(6-Benzyl-2H-indazol-2-yl)-3-fluorobenzyl)aze...)
Show SMILES OC(=O)C1CN(Cc2ccc(c(F)c2)-n2cc3ccc(Cc4ccccc4)cc3n2)C1
Show InChI InChI=1S/C25H22FN3O2/c26-22-11-19(13-28-14-21(15-28)25(30)31)7-9-24(22)29-16-20-8-6-18(12-23(20)27-29)10-17-4-2-1-3-5-17/h1-9,11-12,16,21H,10,13-15H2,(H,30,31)
NCI pathway
Reactome pathway
n/an/an/an/a 2.71E+3n/an/an/an/a
TBA
Curated by ChEMBL
Assay Description
Agonist activity at human S1P3 receptor expressed in CHO-K1 cells co-expressing Gq/i5 G-protein assessed as calcium mobilization by FLIPR assay
ACS Med Chem Lett 2: 102-106 (2011)
Article DOI: 10.1021/ml100228m
BindingDB Entry DOI: 10.7270/Q2T72HR9