BDBM50336955 1-(4-(6-Benzylbenzofuran-2-yl)-3-fluorobenzyl)azetidine-3-carboxylic acid::CHEMBL1672554
SMILES: OC(=O)C1CN(Cc2ccc(-c3cc4ccc(Cc5ccccc5)cc4o3)c(F)c2)C1
InChI Key: InChIKey=FMPBLEBAOMIBHP-UHFFFAOYSA-N
Data: 2 EC50
Activity Spreadsheet -- Enzyme Inhibition Constant Data from BindingDB
Found 2 hits for monomerid = 50336955
Trg + Lig
Ki
nM
ΔG°
kcal/mole
IC50
nM
Kd
nM
EC50/IC50
nM
koff
s-1
kon
M-1s-1
pHTemp
°C
Sphingosine 1-phosphate receptor 1
(Homo sapiens (Human))
BDBM50336955
(1-(4-(6-Benzylbenzofuran-2-yl)-3-fluorobenzyl)azet...)
Show SMILES OC(=O)C1CN(Cc2ccc(-c3cc4ccc(Cc5ccccc5)cc4o3)c(F)c2)C1
Show InChI InChI=1S/C26H22FNO3/c27-23-11-19(14-28-15-21(16-28)26(29)30)7-9-22(23)25-13-20-8-6-18(12-24(20)31-25)10-17-4-2-1-3-5-17/h1-9,11-13,21H,10,14-16H2,(H,29,30)
Reactome pathway
n/an/an/an/a 13n/an/an/an/a
TBA
Curated by ChEMBL
Assay Description
Agonist activity at human S1P1 receptor expressed in human U2OS cells co-expressing eGFP assessed as receptor internalization after 1 hr
ACS Med Chem Lett 2: 102-106 (2011)
Article DOI: 10.1021/ml100228m
BindingDB Entry DOI: 10.7270/Q2T72HR9
Sphingosine 1-phosphate receptor 3
(Homo sapiens (Human))
BDBM50336955
(1-(4-(6-Benzylbenzofuran-2-yl)-3-fluorobenzyl)azet...)
Show SMILES OC(=O)C1CN(Cc2ccc(-c3cc4ccc(Cc5ccccc5)cc4o3)c(F)c2)C1
Show InChI InChI=1S/C26H22FNO3/c27-23-11-19(14-28-15-21(16-28)26(29)30)7-9-22(23)25-13-20-8-6-18(12-24(20)31-25)10-17-4-2-1-3-5-17/h1-9,11-13,21H,10,14-16H2,(H,29,30)
NCI pathway
Reactome pathway
n/an/an/an/a 679n/an/an/an/a
TBA
Curated by ChEMBL
Assay Description
Agonist activity at human S1P3 receptor expressed in CHO-K1 cells co-expressing Gq/i5 G-protein assessed as calcium mobilization by FLIPR assay
ACS Med Chem Lett 2: 102-106 (2011)
Article DOI: 10.1021/ml100228m
BindingDB Entry DOI: 10.7270/Q2T72HR9