BDBM50337131 2-((2-methoxy-4-(4-(4-methylpiperazin-1-yl)piperidin-1-yl)phenyl)amino)-5,11-dimethyl-5H-benzo[e]pyrimido[5,4-b][1,4]diazepin-6(11H)-one::CHEMBL1673043
SMILES: COc1cc(ccc1Nc1ncc2N(C)C(=O)c3ccccc3N(C)c2n1)N1CCC(CC1)N1CCN(C)CC1
InChI Key: InChIKey=VVPYTOVXFOGRIN-UHFFFAOYSA-N
Data: 1 IC50
Activity Spreadsheet -- Enzyme Inhibition Constant Data from BindingDB
Found 1 hit for monomerid = 50337131
Trg + Lig
Ki
nM
ΔG°
kcal/mole
IC50
nM
Kd
nM
EC50/IC50
nM
koff
s-1
kon
M-1s-1
pHTemp
°C
Extracellular signal-regulated kinase 5 (ERK5)
(Homo sapiens (Human))
BDBM50337131
(2-((2-methoxy-4-(4-(4-methylpiperazin-1-yl)piperid...)
Show SMILES COc1cc(ccc1Nc1ncc2N(C)C(=O)c3ccccc3N(C)c2n1)N1CCC(CC1)N1CCN(C)CC1
Show InChI InChI=1S/C30H38N8O2/c1-34-15-17-38(18-16-34)21-11-13-37(14-12-21)22-9-10-24(27(19-22)40-4)32-30-31-20-26-28(33-30)35(2)25-8-6-5-7-23(25)29(39)36(26)3/h5-10,19-21H,11-18H2,1-4H3,(H,31,32,33)
n/an/a 200n/an/an/an/an/an/a
TBA
Curated by ChEMBL
Assay Description
Inhibition of EGF-induced BMK1 autophosphorylation in human HeLa cells by SDS-PAGE analysis
ACS Med Chem Lett 2: 195-200 (2011)
Article DOI: 10.1021/ml100304b
BindingDB Entry DOI: 10.7270/Q2222VSB