BDBM50337133 5,11-dimethyl-2-((2-methyl-4-(4-methylpiperazin-1-yl)phenyl)amino)-5H-benzo[e]pyrimido[5,4-b][1,4]diazepin-6(11H)-one::CHEMBL1673045
SMILES: CN1CCN(CC1)c1ccc(Nc2ncc3N(C)C(=O)c4ccccc4N(C)c3n2)c(C)c1
InChI Key: InChIKey=DDFSQXFBHZHGHD-UHFFFAOYSA-N
Data: 1 IC50
Activity Spreadsheet -- Enzyme Inhibition Constant Data from BindingDB
Found 1 hit for monomerid = 50337133
Trg + Lig
Ki
nM
ΔG°
kcal/mole
IC50
nM
Kd
nM
EC50/IC50
nM
koff
s-1
kon
M-1s-1
pHTemp
°C
Extracellular signal-regulated kinase 5 (ERK5)
(Homo sapiens (Human))
BDBM50337133
(5,11-dimethyl-2-((2-methyl-4-(4-methylpiperazin-1-...)
Show SMILES CN1CCN(CC1)c1ccc(Nc2ncc3N(C)C(=O)c4ccccc4N(C)c3n2)c(C)c1
Show InChI InChI=1S/C25H29N7O/c1-17-15-18(32-13-11-29(2)12-14-32)9-10-20(17)27-25-26-16-22-23(28-25)30(3)21-8-6-5-7-19(21)24(33)31(22)4/h5-10,15-16H,11-14H2,1-4H3,(H,26,27,28)
n/an/a 280n/an/an/an/an/an/a
TBA
Curated by ChEMBL
Assay Description
Inhibition of EGF-induced BMK1 autophosphorylation in human HeLa cells by SDS-PAGE analysis
ACS Med Chem Lett 2: 195-200 (2011)
Article DOI: 10.1021/ml100304b
BindingDB Entry DOI: 10.7270/Q2222VSB