BDBM50337140 11-isopropyl-2-((2-methoxy-4-(4-methylpiperazin-1-yl)phenyl)amino)-5-methyl-5H-benzo[e]pyrimido[5,4-b][1,4]diazepin-6(11H)-one::CHEMBL1673052
SMILES: COc1cc(ccc1Nc1ncc2N(C)C(=O)c3ccccc3N(C(C)C)c2n1)N1CCN(C)CC1
InChI Key: InChIKey=YYTFTZONXCQXLW-UHFFFAOYSA-N
Data: 4 IC50
Activity Spreadsheet -- Enzyme Inhibition Constant Data from BindingDB
Found 4 hits for monomerid = 50337140
Trg + Lig
Ki
nM
ΔG°
kcal/mole
IC50
nM
Kd
nM
EC50/IC50
nM
koff
s-1
kon
M-1s-1
pHTemp
°C
Extracellular signal-regulated kinase 5 (ERK5)
(Homo sapiens (Human))
BDBM50337140
(11-isopropyl-2-((2-methoxy-4-(4-methylpiperazin-1-...)
Show SMILES COc1cc(ccc1Nc1ncc2N(C)C(=O)c3ccccc3N(C(C)C)c2n1)N1CCN(C)CC1
Show InChI InChI=1S/C27H33N7O2/c1-18(2)34-22-9-7-6-8-20(22)26(35)32(4)23-17-28-27(30-25(23)34)29-21-11-10-19(16-24(21)36-5)33-14-12-31(3)13-15-33/h6-11,16-18H,12-15H2,1-5H3,(H,28,29,30)
n/an/a 230n/an/an/an/an/an/a
TBA
Curated by ChEMBL
Assay Description
Inhibition of EGF-induced BMK1 autophosphorylation in human HeLa cells by SDS-PAGE analysis
ACS Med Chem Lett 2: 195-200 (2011)
Article DOI: 10.1021/ml100304b
BindingDB Entry DOI: 10.7270/Q2222VSB
Extracellular signal-regulated kinase 5 (ERK5)
(Homo sapiens (Human))
BDBM50337140
(11-isopropyl-2-((2-methoxy-4-(4-methylpiperazin-1-...)
Show SMILES COc1cc(ccc1Nc1ncc2N(C)C(=O)c3ccccc3N(C(C)C)c2n1)N1CCN(C)CC1
Show InChI InChI=1S/C27H33N7O2/c1-18(2)34-22-9-7-6-8-20(22)26(35)32(4)23-17-28-27(30-25(23)34)29-21-11-10-19(16-24(21)36-5)33-14-12-31(3)13-15-33/h6-11,16-18H,12-15H2,1-5H3,(H,28,29,30)
n/an/a 98n/an/an/an/an/an/a
Harvard Medical School
Curated by ChEMBL
Assay Description
Inhibition of ERK5 in human HeLa cells assessed as reduction in EGF-induced ERK5 autophosphorylation pretreated for 1 hr followed by EGF stimulation ...
J Med Chem 63: 7817-7826 (2020)
Leucine-rich repeat serine/threonine-protein kinase 2
(Homo sapiens (Human))
BDBM50337140
(11-isopropyl-2-((2-methoxy-4-(4-methylpiperazin-1-...)
Show SMILES COc1cc(ccc1Nc1ncc2N(C)C(=O)c3ccccc3N(C(C)C)c2n1)N1CCN(C)CC1
Show InChI InChI=1S/C27H33N7O2/c1-18(2)34-22-9-7-6-8-20(22)26(35)32(4)23-17-28-27(30-25(23)34)29-21-11-10-19(16-24(21)36-5)33-14-12-31(3)13-15-33/h6-11,16-18H,12-15H2,1-5H3,(H,28,29,30)
n/an/a 289n/an/an/an/an/an/a
Harvard Medical School
Curated by ChEMBL
Assay Description
Inhibition of recombinant human GST-tagged LRRK2 catalytic domain (970 to 2527 residues) expressed in baculovirus expression system using LRRKtide as...
J Med Chem 63: 7817-7826 (2020)
Serine/threonine-protein kinase DCLK1
(Homo sapiens (Human))
BDBM50337140
(11-isopropyl-2-((2-methoxy-4-(4-methylpiperazin-1-...)
Show SMILES COc1cc(ccc1Nc1ncc2N(C)C(=O)c3ccccc3N(C(C)C)c2n1)N1CCN(C)CC1
Show InChI InChI=1S/C27H33N7O2/c1-18(2)34-22-9-7-6-8-20(22)26(35)32(4)23-17-28-27(30-25(23)34)29-21-11-10-19(16-24(21)36-5)33-14-12-31(3)13-15-33/h6-11,16-18H,12-15H2,1-5H3,(H,28,29,30)
n/an/a 71n/an/an/an/an/an/a
Harvard Medical School
Curated by ChEMBL
Assay Description
Inhibition of recombinant human N-terminal His6-tagged DCLK1 (G351 to H689 residues) expressed in Escherichia coli BL21 DE3 using 5-FAM-KKLRRTLSVA-CO...
J Med Chem 63: 7817-7826 (2020)