BDBM50337671 1-benzyl-3-isopropyl-1-(3-((2-methoxyphenyl)ethynyl)benzyl)urea::CHEMBL1683198
SMILES: COc1ccccc1C#Cc1cccc(CN(Cc2ccccc2)C(=O)NC(C)C)c1
InChI Key: InChIKey=MOVZHHZYBDCXQO-UHFFFAOYSA-N
Data: 1 IC50
Activity Spreadsheet -- Enzyme Inhibition Constant Data from BindingDB
Found 1 hit for monomerid = 50337671
Trg + Lig
Ki
nM
ΔG°
kcal/mole
IC50
nM
Kd
nM
EC50/IC50
nM
koff
s-1
kon
M-1s-1
pHTemp
°C
Prostaglandin E synthase
(Homo sapiens (Human))
BDBM50337671
(1-benzyl-3-isopropyl-1-(3-((2-methoxyphenyl)ethyny...)
Show SMILES COc1ccccc1C#Cc1cccc(CN(Cc2ccccc2)C(=O)NC(C)C)c1
Show InChI InChI=1S/C27H28N2O2/c1-21(2)28-27(30)29(19-23-10-5-4-6-11-23)20-24-13-9-12-22(18-24)16-17-25-14-7-8-15-26(25)31-3/h4-15,18,21H,19-20H2,1-3H3,(H,28,30)
Reactome pathway
n/an/a 150n/an/an/an/an/an/a
Merck Frosst Center for Therapeutic Research
Curated by ChEMBL
Assay Description
Inhibition of mPGES1
Bioorg Med Chem Lett 21: 1488-92 (2011)
Article DOI: 10.1016/j.bmcl.2011.01.006
BindingDB Entry DOI: 10.7270/Q2XS5VNP