BDBM50338111 2,4-dimethyl-N-(3-(6-methyl-1H-indol-2-yl)-1H-indazol-5-yl)thiazole-5-sulfonamide::CHEMBL1684527
SMILES: Cc1nc(C)c(s1)S(=O)(=O)Nc1ccc2[nH]nc(-c3cc4ccc(C)cc4[nH]3)c2c1
InChI Key: InChIKey=UKDSTGXCKQSPPU-UHFFFAOYSA-N
Data: 1 IC50
Activity Spreadsheet -- Enzyme Inhibition Constant Data from BindingDB
Found 1 hit for monomerid = 50338111
Trg + Lig
Ki
nM
ΔG°
kcal/mole
IC50
nM
Kd
nM
EC50/IC50
nM
koff
s-1
kon
M-1s-1
pHTemp
°C
Tyrosine-protein kinase ITK/TSK
(Homo sapiens (Human))
BDBM50338111
(2,4-dimethyl-N-(3-(6-methyl-1H-indol-2-yl)-1H-inda...)
Show SMILES Cc1nc(C)c(s1)S(=O)(=O)Nc1ccc2[nH]nc(-c3cc4ccc(C)cc4[nH]3)c2c1
Show InChI InChI=1S/C21H19N5O2S2/c1-11-4-5-14-9-19(23-18(14)8-11)20-16-10-15(6-7-17(16)24-25-20)26-30(27,28)21-12(2)22-13(3)29-21/h4-10,23,26H,1-3H3,(H,24,25)
Reactome pathway
n/an/a 190n/an/an/an/an/an/a
Nycomed GmbH
Curated by ChEMBL
Assay Description
Inhibition of recombinant GST-tagged full-length ITK expressed in baculovirus expression system after 30 mins by scintillation proximity assay
Bioorg Med Chem Lett 21: 1852-6 (2011)
Article DOI: 10.1016/j.bmcl.2011.01.035
BindingDB Entry DOI: 10.7270/Q2MC90BW