null
SMILES: CCCN(CC)c1ncc(c(N[C@@H](Cc2ccc(OC(=O)N(C)C)cc2)C(O)=O)n1)-c1ccccc1C
InChI Key: InChIKey=GERYTDGNULKRJC-DEOSSOPVSA-N
Activity Spreadsheet -- Enzyme Inhibition Constant Data from BindingDB
Found 1 hit for monomerid = 50338194
Trg + Lig
Ki
nM
ΔG°
kcal/mole
IC50
nM
Kd
nM
EC50/IC50
nM
koff
s-1
kon
M-1s-1
pHTemp
°C
Integrin alpha-4/beta-1
(Homo sapiens (Human))
BDBM50338194
((2S)-3-(4-(dimethylcarbamoyloxy)phenyl)-2-(2-(ethy...)
Show SMILES CCCN(CC)c1ncc(c(N[C@@H](Cc2ccc(OC(=O)N(C)C)cc2)C(O)=O)n1)-c1ccccc1C |r|
Show InChI InChI=1S/C28H35N5O4/c1-6-16-33(7-2)27-29-18-23(22-11-9-8-10-19(22)3)25(31-27)30-24(26(34)35)17-20-12-14-21(15-13-20)37-28(36)32(4)5/h8-15,18,24H,6-7,16-17H2,1-5H3,(H,34,35)(H,29,30,31)/t24-/m0/s1
Reactome pathway
n/an/a 4.90n/an/an/an/an/an/a
Elan Pharmaceuticals, Inc.
Curated by ChEMBL
Assay Description
Inhibition of integrin alpha4beta1-mediated Jurkat cell adhesion to VCAM-1 by FACS analysis
Bioorg Med Chem Lett 21: 1741-3 (2011)
Article DOI: 10.1016/j.bmcl.2011.01.075
BindingDB Entry DOI: 10.7270/Q2N58NM6