BDBM50338222 1-(4-(6-amino-5-((methoxyimino)methyl)pyrimidin-4-yloxy)-2-chlorophenyl)-3-(4-fluorophenyl)urea::CHEMBL1681952
SMILES: CO\N=C\c1c(N)ncnc1Oc1ccc(NC(=O)Nc2ccc(F)cc2)c(Cl)c1
InChI Key: InChIKey=GDLRVVXLZRJAHT-YCPBAFNGSA-N
Data: 1 IC50
Activity Spreadsheet -- Enzyme Inhibition Constant Data from BindingDB
Found 1 hit for monomerid = 50338222
Trg + Lig
Ki
nM
ΔG°
kcal/mole
IC50
nM
Kd
nM
EC50/IC50
nM
koff
s-1
kon
M-1s-1
pHTemp
°C
Vascular endothelial growth factor receptor 2
(Homo sapiens (Human))
BDBM50338222
(1-(4-(6-amino-5-((methoxyimino)methyl)pyrimidin-4-...)
Show SMILES CO\N=C\c1c(N)ncnc1Oc1ccc(NC(=O)Nc2ccc(F)cc2)c(Cl)c1
Show InChI InChI=1S/C19H16ClFN6O3/c1-29-25-9-14-17(22)23-10-24-18(14)30-13-6-7-16(15(20)8-13)27-19(28)26-12-4-2-11(21)3-5-12/h2-10H,1H3,(H2,22,23,24)(H2,26,27,28)/b25-9+
NCI pathway
Reactome pathway
n/an/a 2.80n/an/an/an/an/an/a
Johnson& Johnson Pharmaceutical Research& Development LLC
Curated by ChEMBL
Assay Description
Inhibition of VEGFR2
Bioorg Med Chem Lett 21: 1815-8 (2011)
Article DOI: 10.1016/j.bmcl.2011.01.053
BindingDB Entry DOI: 10.7270/Q2ZP46DK