null
SMILES: Brc1csc(NC(=O)Cc2cccc3ncccc23)c1-c1nnc[nH]1
InChI Key: InChIKey=IHBXLESUKAAQDQ-UHFFFAOYSA-N
Activity Spreadsheet -- Enzyme Inhibition Constant Data from BindingDB
Found 5 hits for monomerid = 50338265
Trg + Lig
Ki
nM
ΔG°
kcal/mole
IC50
nM
Kd
nM
EC50/IC50
nM
koff
s-1
kon
M-1s-1
pHTemp
°C
Mitogen-activated protein kinase 10
(Homo sapiens (Human))
BDBM50338265
(CHEMBL1682019 | N-(4-bromo-3-(1H-1,2,4-triazol-5-y...)
Show SMILES Brc1csc(NC(=O)Cc2cccc3ncccc23)c1-c1nnc[nH]1
Show InChI InChI=1S/C17H12BrN5OS/c18-12-8-25-17(15(12)16-20-9-21-23-16)22-14(24)7-10-3-1-5-13-11(10)4-2-6-19-13/h1-6,8-9H,7H2,(H,22,24)(H,20,21,23)
NCI pathway
Reactome pathway
n/an/a 34n/an/an/an/an/an/a
Elan Pharmaceuticals, Inc.
Curated by ChEMBL
Assay Description
Inhibition of recombinant JNK3 after 60 mins by TR-FRET assay
Bioorg Med Chem Lett 21: 1838-43 (2011)
Article DOI: 10.1016/j.bmcl.2011.01.046
BindingDB Entry DOI: 10.7270/Q2Q52PX0
Mitogen-activated protein kinase 9
(Homo sapiens (Human))
BDBM50338265
(CHEMBL1682019 | N-(4-bromo-3-(1H-1,2,4-triazol-5-y...)
Show SMILES Brc1csc(NC(=O)Cc2cccc3ncccc23)c1-c1nnc[nH]1
Show InChI InChI=1S/C17H12BrN5OS/c18-12-8-25-17(15(12)16-20-9-21-23-16)22-14(24)7-10-3-1-5-13-11(10)4-2-6-19-13/h1-6,8-9H,7H2,(H,22,24)(H,20,21,23)
NCI pathway
Reactome pathway
n/an/a 90n/an/an/an/an/an/a
Elan Pharmaceuticals, Inc.
Curated by ChEMBL
Assay Description
Inhibition of recombinant JNK2 after 60 mins by TR-FRET assay
Bioorg Med Chem Lett 21: 1838-43 (2011)
Article DOI: 10.1016/j.bmcl.2011.01.046
BindingDB Entry DOI: 10.7270/Q2Q52PX0
Mitogen-activated protein kinase 1
(Homo sapiens (Human))
BDBM50338265
(CHEMBL1682019 | N-(4-bromo-3-(1H-1,2,4-triazol-5-y...)
Show SMILES Brc1csc(NC(=O)Cc2cccc3ncccc23)c1-c1nnc[nH]1
Show InChI InChI=1S/C17H12BrN5OS/c18-12-8-25-17(15(12)16-20-9-21-23-16)22-14(24)7-10-3-1-5-13-11(10)4-2-6-19-13/h1-6,8-9H,7H2,(H,22,24)(H,20,21,23)
NCI pathway
Reactome pathway
n/an/a>5.00E+4n/an/an/an/an/an/a
Elan Pharmaceuticals, Inc.
Curated by ChEMBL
Assay Description
Inhibition of recombinant ERK2 after 60 mins by TR-FRET assay
Bioorg Med Chem Lett 21: 1838-43 (2011)
Article DOI: 10.1016/j.bmcl.2011.01.046
BindingDB Entry DOI: 10.7270/Q2Q52PX0
Mitogen-activated protein kinase 14
(Homo sapiens (Human))
BDBM50338265
(CHEMBL1682019 | N-(4-bromo-3-(1H-1,2,4-triazol-5-y...)
Show SMILES Brc1csc(NC(=O)Cc2cccc3ncccc23)c1-c1nnc[nH]1
Show InChI InChI=1S/C17H12BrN5OS/c18-12-8-25-17(15(12)16-20-9-21-23-16)22-14(24)7-10-3-1-5-13-11(10)4-2-6-19-13/h1-6,8-9H,7H2,(H,22,24)(H,20,21,23)
NCI pathway
Reactome pathway
n/an/a>5.00E+4n/an/an/an/an/an/a
Elan Pharmaceuticals, Inc.
Curated by ChEMBL
Assay Description
Inhibition of recombinant p38alpha after 60 mins by TR-FRET assay
Bioorg Med Chem Lett 21: 1838-43 (2011)
Article DOI: 10.1016/j.bmcl.2011.01.046
BindingDB Entry DOI: 10.7270/Q2Q52PX0
Mitogen-activated protein kinase 8
(Homo sapiens (Human))
BDBM50338265
(CHEMBL1682019 | N-(4-bromo-3-(1H-1,2,4-triazol-5-y...)
Show SMILES Brc1csc(NC(=O)Cc2cccc3ncccc23)c1-c1nnc[nH]1
Show InChI InChI=1S/C17H12BrN5OS/c18-12-8-25-17(15(12)16-20-9-21-23-16)22-14(24)7-10-3-1-5-13-11(10)4-2-6-19-13/h1-6,8-9H,7H2,(H,22,24)(H,20,21,23)
NCI pathway
Reactome pathway
n/an/a 42n/an/an/an/an/an/a
Elan Pharmaceuticals, Inc.
Curated by ChEMBL
Assay Description
Inhibition of recombinant JNK1 after 60 mins by TR-FRET assay
Bioorg Med Chem Lett 21: 1838-43 (2011)
Article DOI: 10.1016/j.bmcl.2011.01.046
BindingDB Entry DOI: 10.7270/Q2Q52PX0