BDBM50338304 (+/-)-(3R,4S)-5,7,8-trifluoro-6-(1H-indol-7-yl)-2,2,4-trimethyl-1,2,3,4-tetrahydroquinolin-3-ol::CHEMBL1682438
SMILES: C[C@@H]1[C@@H](O)C(C)(C)Nc2c(F)c(F)c(c(F)c12)-c1cccc2cc[nH]c12
InChI Key: InChIKey=XRYJPXTUVITKHR-ZRNGKTOUSA-N
Data: 1 KI  2 IC50  1 EC50
Activity Spreadsheet -- Enzyme Inhibition Constant Data from BindingDB
Found 4 hits for monomerid = 50338304
Trg + Lig
Ki
nM
ΔG°
kcal/mole
IC50
nM
Kd
nM
EC50/IC50
nM
koff
s-1
kon
M-1s-1
pHTemp
°C
Glucocorticoid receptor
(Homo sapiens (Human))
BDBM50338304
((+/-)-(3R,4S)-5,7,8-trifluoro-6-(1H-indol-7-yl)-2,...)
Show SMILES C[C@@H]1[C@@H](O)C(C)(C)Nc2c(F)c(F)c(c(F)c12)-c1cccc2cc[nH]c12 |r,wU:2.2,wD:1.0,(12.83,-9.68,;12.84,-11.23,;14.17,-12.02,;15.51,-11.27,;14.15,-13.57,;14.13,-15.1,;15.68,-13.56,;12.8,-14.31,;11.48,-13.53,;10.14,-14.29,;10.12,-15.83,;8.81,-13.5,;7.47,-14.25,;8.84,-11.96,;10.18,-11.21,;10.19,-9.66,;11.5,-11.99,;7.52,-11.17,;6.18,-11.92,;4.85,-11.13,;4.88,-9.59,;6.21,-8.85,;6.55,-7.34,;8.09,-7.2,;8.7,-8.62,;7.54,-9.63,)|
Show InChI InChI=1S/C20H19F3N2O/c1-9-12-14(21)13(11-6-4-5-10-7-8-24-17(10)11)15(22)16(23)18(12)25-20(2,3)19(9)26/h4-9,19,24-26H,1-3H3/t9-,19+/m0/s1
5n/an/an/an/an/an/an/an/a
Ligand Pharmaceuticals
Curated by ChEMBL
Assay Description
Displacement of radiolabeled dexamethasone from GR
Bioorg Med Chem Lett 21: 1697-700 (2011)
Article DOI: 10.1016/j.bmcl.2011.01.093
BindingDB Entry DOI: 10.7270/Q2639Q12
Glucocorticoid receptor
(Homo sapiens (Human))
BDBM50338304
((+/-)-(3R,4S)-5,7,8-trifluoro-6-(1H-indol-7-yl)-2,...)
Show SMILES C[C@@H]1[C@@H](O)C(C)(C)Nc2c(F)c(F)c(c(F)c12)-c1cccc2cc[nH]c12 |r,wU:2.2,wD:1.0,(12.83,-9.68,;12.84,-11.23,;14.17,-12.02,;15.51,-11.27,;14.15,-13.57,;14.13,-15.1,;15.68,-13.56,;12.8,-14.31,;11.48,-13.53,;10.14,-14.29,;10.12,-15.83,;8.81,-13.5,;7.47,-14.25,;8.84,-11.96,;10.18,-11.21,;10.19,-9.66,;11.5,-11.99,;7.52,-11.17,;6.18,-11.92,;4.85,-11.13,;4.88,-9.59,;6.21,-8.85,;6.55,-7.34,;8.09,-7.2,;8.7,-8.62,;7.54,-9.63,)|
Show InChI InChI=1S/C20H19F3N2O/c1-9-12-14(21)13(11-6-4-5-10-7-8-24-17(10)11)15(22)16(23)18(12)25-20(2,3)19(9)26/h4-9,19,24-26H,1-3H3/t9-,19+/m0/s1
n/an/an/an/a 16n/an/an/an/a
Ligand Pharmaceuticals
Curated by ChEMBL
Assay Description
Agonist activity at GR expressed in african green monkey CV1 cells transfected with luciferase gene linked to MMTV promoter assessed as induction of ...
Bioorg Med Chem Lett 21: 1697-700 (2011)
Article DOI: 10.1016/j.bmcl.2011.01.093
BindingDB Entry DOI: 10.7270/Q2639Q12
Glucocorticoid receptor
(Homo sapiens (Human))
BDBM50338304
((+/-)-(3R,4S)-5,7,8-trifluoro-6-(1H-indol-7-yl)-2,...)
Show SMILES C[C@@H]1[C@@H](O)C(C)(C)Nc2c(F)c(F)c(c(F)c12)-c1cccc2cc[nH]c12 |r,wU:2.2,wD:1.0,(12.83,-9.68,;12.84,-11.23,;14.17,-12.02,;15.51,-11.27,;14.15,-13.57,;14.13,-15.1,;15.68,-13.56,;12.8,-14.31,;11.48,-13.53,;10.14,-14.29,;10.12,-15.83,;8.81,-13.5,;7.47,-14.25,;8.84,-11.96,;10.18,-11.21,;10.19,-9.66,;11.5,-11.99,;7.52,-11.17,;6.18,-11.92,;4.85,-11.13,;4.88,-9.59,;6.21,-8.85,;6.55,-7.34,;8.09,-7.2,;8.7,-8.62,;7.54,-9.63,)|
Show InChI InChI=1S/C20H19F3N2O/c1-9-12-14(21)13(11-6-4-5-10-7-8-24-17(10)11)15(22)16(23)18(12)25-20(2,3)19(9)26/h4-9,19,24-26H,1-3H3/t9-,19+/m0/s1
n/an/a 19n/an/an/an/an/an/a
Ligand Pharmaceuticals
Curated by ChEMBL
Assay Description
Agonist activity at human GR expressed in NHDF cells assessed as inhibition of IL-6 production by ELISA relative to dexamethasone
Bioorg Med Chem Lett 21: 1697-700 (2011)
Article DOI: 10.1016/j.bmcl.2011.01.093
BindingDB Entry DOI: 10.7270/Q2639Q12
Glucocorticoid receptor
(Homo sapiens (Human))
BDBM50338304
((+/-)-(3R,4S)-5,7,8-trifluoro-6-(1H-indol-7-yl)-2,...)
Show SMILES C[C@@H]1[C@@H](O)C(C)(C)Nc2c(F)c(F)c(c(F)c12)-c1cccc2cc[nH]c12 |r,wU:2.2,wD:1.0,(12.83,-9.68,;12.84,-11.23,;14.17,-12.02,;15.51,-11.27,;14.15,-13.57,;14.13,-15.1,;15.68,-13.56,;12.8,-14.31,;11.48,-13.53,;10.14,-14.29,;10.12,-15.83,;8.81,-13.5,;7.47,-14.25,;8.84,-11.96,;10.18,-11.21,;10.19,-9.66,;11.5,-11.99,;7.52,-11.17,;6.18,-11.92,;4.85,-11.13,;4.88,-9.59,;6.21,-8.85,;6.55,-7.34,;8.09,-7.2,;8.7,-8.62,;7.54,-9.63,)|
Show InChI InChI=1S/C20H19F3N2O/c1-9-12-14(21)13(11-6-4-5-10-7-8-24-17(10)11)15(22)16(23)18(12)25-20(2,3)19(9)26/h4-9,19,24-26H,1-3H3/t9-,19+/m0/s1
n/an/a 3.80n/an/an/an/an/an/a
Ligand Pharmaceuticals
Curated by ChEMBL
Assay Description
Agonist activity at GR expressed in IL-1beta- and TNFalpha-stimulated HepG2 cells assessed as inhibition of NFKB- or AP-1 mediated E-selectin transcr...
Bioorg Med Chem Lett 21: 1697-700 (2011)
Article DOI: 10.1016/j.bmcl.2011.01.093
BindingDB Entry DOI: 10.7270/Q2639Q12