BDBM50338366 (S)-1-(1H-imidazol-4-yl)-1-(6-methoxynaphthalen-2-yl)-2-methylpropan-1-ol::CHEMBL1682887
SMILES: COc1ccc2cc(ccc2c1)[C@@](O)(C(C)C)c1cnc[nH]1
InChI Key: InChIKey=FJJLMFGGWNDUMR-SFHVURJKSA-N
Data: 2 IC50
Activity Spreadsheet -- Enzyme Inhibition Constant Data from BindingDB
Found 2 hits for monomerid = 50338366
Trg + Lig
Ki
nM
ΔG°
kcal/mole
IC50
nM
Kd
nM
EC50/IC50
nM
koff
s-1
kon
M-1s-1
pHTemp
°C
Cytochrome P450 17A1
(Homo sapiens (Human))
BDBM50338366
((S)-1-(1H-imidazol-4-yl)-1-(6-methoxynaphthalen-2-...)
Show SMILES COc1ccc2cc(ccc2c1)[C@@](O)(C(C)C)c1cnc[nH]1 |r|
Show InChI InChI=1S/C18H20N2O2/c1-12(2)18(21,17-10-19-11-20-17)15-6-4-14-9-16(22-3)7-5-13(14)8-15/h4-12,21H,1-3H3,(H,19,20)/t18-/m0/s1
Reactome pathway
n/an/a 28n/an/an/an/an/an/a
Takeda Pharmaceutical Company, Ltd
Curated by ChEMBL
Assay Description
Inhibition of 17,20 lyase activity in human
Bioorg Med Chem 19: 1751-70 (2011)
Article DOI: 10.1016/j.bmc.2011.01.017
BindingDB Entry DOI: 10.7270/Q2X92C9F
Cytochrome P450 17A1
(Rattus norvegicus (Rat))
BDBM50338366
((S)-1-(1H-imidazol-4-yl)-1-(6-methoxynaphthalen-2-...)
Show SMILES COc1ccc2cc(ccc2c1)[C@@](O)(C(C)C)c1cnc[nH]1 |r|
Show InChI InChI=1S/C18H20N2O2/c1-12(2)18(21,17-10-19-11-20-17)15-6-4-14-9-16(22-3)7-5-13(14)8-15/h4-12,21H,1-3H3,(H,19,20)/t18-/m0/s1
n/an/a 21n/an/an/an/an/an/a
Takeda Pharmaceutical Company, Ltd
Curated by ChEMBL
Assay Description
Inhibition of 17,20 lyase activity in Sprague-Dawley rat testicular microsomes
Bioorg Med Chem 19: 1751-70 (2011)
Article DOI: 10.1016/j.bmc.2011.01.017
BindingDB Entry DOI: 10.7270/Q2X92C9F