BDBM50338445 CHEMBL1682979::trans-4-amino-N-(4-((R)-1-amino-2-(2,5-difluorophenyl)ethyl)cyclohexyl)-N-methylbenzenesulfonamide
SMILES: CN([C@H]1CC[C@@H](CC1)[C@H](N)Cc1cc(F)ccc1F)S(=O)(=O)c1ccc(N)cc1
InChI Key: InChIKey=FGSQZCONGXWKQY-CFCCAZDESA-N
Data: 5 IC50
Activity Spreadsheet -- Enzyme Inhibition Constant Data from BindingDB
Found 5 hits for monomerid = 50338445
Trg + Lig
Ki
nM
ΔG°
kcal/mole
IC50
nM
Kd
nM
EC50/IC50
nM
koff
s-1
kon
M-1s-1
pHTemp
°C
Fibroblast activation protein alpha
(Homo sapiens (Human))
BDBM50338445
(CHEMBL1682979 | trans-4-amino-N-(4-((R)-1-amino-2-...)
Show SMILES CN([C@H]1CC[C@@H](CC1)[C@H](N)Cc1cc(F)ccc1F)S(=O)(=O)c1ccc(N)cc1 |r,wU:8.9,2.1,wD:5.4,(20.29,-13.03,;20.29,-11.49,;18.96,-10.71,;17.62,-11.48,;16.29,-10.71,;16.3,-9.18,;17.62,-8.4,;18.96,-9.17,;14.96,-8.41,;14.96,-6.87,;13.63,-9.18,;12.3,-8.41,;12.29,-6.86,;10.96,-6.1,;10.95,-4.56,;9.63,-6.87,;9.62,-8.41,;10.96,-9.18,;10.96,-10.72,;21.62,-10.72,;20.84,-9.38,;22.38,-9.38,;22.95,-11.49,;22.95,-13.02,;24.27,-13.79,;25.6,-13.03,;26.94,-13.8,;25.6,-11.48,;24.27,-10.72,)|
Show InChI InChI=1S/C21H27F2N3O2S/c1-26(29(27,28)19-9-5-17(24)6-10-19)18-7-2-14(3-8-18)21(25)13-15-12-16(22)4-11-20(15)23/h4-6,9-12,14,18,21H,2-3,7-8,13,24-25H2,1H3/t14-,18-,21-/m1/s1
n/an/a>3.50E+4n/an/an/an/an/an/a
Merck Research Laboratories
Curated by ChEMBL
Assay Description
Inhibition of FAP
Bioorg Med Chem Lett 21: 1880-6 (2011)
Article DOI: 10.1016/j.bmcl.2010.12.060
BindingDB Entry DOI: 10.7270/Q2SX6DJG
Dipeptidyl peptidase VIII
(Homo sapiens (Human))
BDBM50338445
(CHEMBL1682979 | trans-4-amino-N-(4-((R)-1-amino-2-...)
Show SMILES CN([C@H]1CC[C@@H](CC1)[C@H](N)Cc1cc(F)ccc1F)S(=O)(=O)c1ccc(N)cc1 |r,wU:8.9,2.1,wD:5.4,(20.29,-13.03,;20.29,-11.49,;18.96,-10.71,;17.62,-11.48,;16.29,-10.71,;16.3,-9.18,;17.62,-8.4,;18.96,-9.17,;14.96,-8.41,;14.96,-6.87,;13.63,-9.18,;12.3,-8.41,;12.29,-6.86,;10.96,-6.1,;10.95,-4.56,;9.63,-6.87,;9.62,-8.41,;10.96,-9.18,;10.96,-10.72,;21.62,-10.72,;20.84,-9.38,;22.38,-9.38,;22.95,-11.49,;22.95,-13.02,;24.27,-13.79,;25.6,-13.03,;26.94,-13.8,;25.6,-11.48,;24.27,-10.72,)|
Show InChI InChI=1S/C21H27F2N3O2S/c1-26(29(27,28)19-9-5-17(24)6-10-19)18-7-2-14(3-8-18)21(25)13-15-12-16(22)4-11-20(15)23/h4-6,9-12,14,18,21H,2-3,7-8,13,24-25H2,1H3/t14-,18-,21-/m1/s1
n/an/a 6.90E+4n/an/an/an/an/an/a
Merck Research Laboratories
Curated by ChEMBL
Assay Description
Inhibition of DPP8
Bioorg Med Chem Lett 21: 1880-6 (2011)
Article DOI: 10.1016/j.bmcl.2010.12.060
BindingDB Entry DOI: 10.7270/Q2SX6DJG
Dipeptidyl peptidase 9
(Homo sapiens (Human))
BDBM50338445
(CHEMBL1682979 | trans-4-amino-N-(4-((R)-1-amino-2-...)
Show SMILES CN([C@H]1CC[C@@H](CC1)[C@H](N)Cc1cc(F)ccc1F)S(=O)(=O)c1ccc(N)cc1 |r,wU:8.9,2.1,wD:5.4,(20.29,-13.03,;20.29,-11.49,;18.96,-10.71,;17.62,-11.48,;16.29,-10.71,;16.3,-9.18,;17.62,-8.4,;18.96,-9.17,;14.96,-8.41,;14.96,-6.87,;13.63,-9.18,;12.3,-8.41,;12.29,-6.86,;10.96,-6.1,;10.95,-4.56,;9.63,-6.87,;9.62,-8.41,;10.96,-9.18,;10.96,-10.72,;21.62,-10.72,;20.84,-9.38,;22.38,-9.38,;22.95,-11.49,;22.95,-13.02,;24.27,-13.79,;25.6,-13.03,;26.94,-13.8,;25.6,-11.48,;24.27,-10.72,)|
Show InChI InChI=1S/C21H27F2N3O2S/c1-26(29(27,28)19-9-5-17(24)6-10-19)18-7-2-14(3-8-18)21(25)13-15-12-16(22)4-11-20(15)23/h4-6,9-12,14,18,21H,2-3,7-8,13,24-25H2,1H3/t14-,18-,21-/m1/s1
n/an/a 6.10E+4n/an/an/an/an/an/a
Merck Research Laboratories
Curated by ChEMBL
Assay Description
Inhibition of DPP9
Bioorg Med Chem Lett 21: 1880-6 (2011)
Article DOI: 10.1016/j.bmcl.2010.12.060
BindingDB Entry DOI: 10.7270/Q2SX6DJG
Dipeptidyl peptidase 4
(Homo sapiens (Human))
BDBM50338445
(CHEMBL1682979 | trans-4-amino-N-(4-((R)-1-amino-2-...)
Show SMILES CN([C@H]1CC[C@@H](CC1)[C@H](N)Cc1cc(F)ccc1F)S(=O)(=O)c1ccc(N)cc1 |r,wU:8.9,2.1,wD:5.4,(20.29,-13.03,;20.29,-11.49,;18.96,-10.71,;17.62,-11.48,;16.29,-10.71,;16.3,-9.18,;17.62,-8.4,;18.96,-9.17,;14.96,-8.41,;14.96,-6.87,;13.63,-9.18,;12.3,-8.41,;12.29,-6.86,;10.96,-6.1,;10.95,-4.56,;9.63,-6.87,;9.62,-8.41,;10.96,-9.18,;10.96,-10.72,;21.62,-10.72,;20.84,-9.38,;22.38,-9.38,;22.95,-11.49,;22.95,-13.02,;24.27,-13.79,;25.6,-13.03,;26.94,-13.8,;25.6,-11.48,;24.27,-10.72,)|
Show InChI InChI=1S/C21H27F2N3O2S/c1-26(29(27,28)19-9-5-17(24)6-10-19)18-7-2-14(3-8-18)21(25)13-15-12-16(22)4-11-20(15)23/h4-6,9-12,14,18,21H,2-3,7-8,13,24-25H2,1H3/t14-,18-,21-/m1/s1
Reactome pathway
n/an/a 140n/an/an/an/an/an/a
Merck Research Laboratories
Curated by ChEMBL
Assay Description
Inhibition of DPP4
Bioorg Med Chem Lett 21: 1880-6 (2011)
Article DOI: 10.1016/j.bmcl.2010.12.060
BindingDB Entry DOI: 10.7270/Q2SX6DJG
Dipeptidyl peptidase 2 (DPP II)
(Homo sapiens (Human))
BDBM50338445
(CHEMBL1682979 | trans-4-amino-N-(4-((R)-1-amino-2-...)
Show SMILES CN([C@H]1CC[C@@H](CC1)[C@H](N)Cc1cc(F)ccc1F)S(=O)(=O)c1ccc(N)cc1 |r,wU:8.9,2.1,wD:5.4,(20.29,-13.03,;20.29,-11.49,;18.96,-10.71,;17.62,-11.48,;16.29,-10.71,;16.3,-9.18,;17.62,-8.4,;18.96,-9.17,;14.96,-8.41,;14.96,-6.87,;13.63,-9.18,;12.3,-8.41,;12.29,-6.86,;10.96,-6.1,;10.95,-4.56,;9.63,-6.87,;9.62,-8.41,;10.96,-9.18,;10.96,-10.72,;21.62,-10.72,;20.84,-9.38,;22.38,-9.38,;22.95,-11.49,;22.95,-13.02,;24.27,-13.79,;25.6,-13.03,;26.94,-13.8,;25.6,-11.48,;24.27,-10.72,)|
Show InChI InChI=1S/C21H27F2N3O2S/c1-26(29(27,28)19-9-5-17(24)6-10-19)18-7-2-14(3-8-18)21(25)13-15-12-16(22)4-11-20(15)23/h4-6,9-12,14,18,21H,2-3,7-8,13,24-25H2,1H3/t14-,18-,21-/m1/s1
n/an/a 1.90E+4n/an/an/an/an/an/a
Merck Research Laboratories
Curated by ChEMBL
Assay Description
Inhibition of QPP
Bioorg Med Chem Lett 21: 1880-6 (2011)
Article DOI: 10.1016/j.bmcl.2010.12.060
BindingDB Entry DOI: 10.7270/Q2SX6DJG