BDBM50338512 1-((3S,4S)-4-amino-1-(6-(cyclopropylamino)pyrimidin-4-yl)pyrrolidin-3-yl)piperidin-2-one::CHEMBL1683565
SMILES: N[C@H]1CN(C[C@@H]1N1CCCCC1=O)c1cc(NC2CC2)ncn1
InChI Key: InChIKey=FWCJGYLNPZAQHS-STQMWFEESA-N
Data: 1 IC50
Activity Spreadsheet -- Enzyme Inhibition Constant Data from BindingDB
Found 1 hit for monomerid = 50338512
Trg + Lig
Ki
nM
ΔG°
kcal/mole
IC50
nM
Kd
nM
EC50/IC50
nM
koff
s-1
kon
M-1s-1
pHTemp
°C
Dipeptidyl peptidase 4
(Homo sapiens (Human))
BDBM50338512
(1-((3S,4S)-4-amino-1-(6-(cyclopropylamino)pyrimidi...)
Show SMILES N[C@H]1CN(C[C@@H]1N1CCCCC1=O)c1cc(NC2CC2)ncn1 |r|
Show InChI InChI=1S/C16H24N6O/c17-12-8-21(9-13(12)22-6-2-1-3-16(22)23)15-7-14(18-10-19-15)20-11-4-5-11/h7,10-13H,1-6,8-9,17H2,(H,18,19,20)/t12-,13-/m0/s1
Reactome pathway
n/an/a 74n/an/an/an/an/an/a
Pfizer Inc.
Curated by ChEMBL
Assay Description
Inhibition of human DPP4
Bioorg Med Chem Lett 21: 1810-4 (2011)
Article DOI: 10.1016/j.bmcl.2011.01.055
BindingDB Entry DOI: 10.7270/Q28W3DM7