null
SMILES: COc1cc(cc2c1nc([nH]c2=O)C1COc2ccc(F)cc2C1)-c1cn[nH]c1
InChI Key: InChIKey=JTYONDMXPITWLF-UHFFFAOYSA-N
Activity Spreadsheet -- Enzyme Inhibition Constant Data from BindingDB
Found 1 hit for monomerid = 50338718
Trg + Lig
Ki
nM
ΔG°
kcal/mole
IC50
nM
Kd
nM
EC50/IC50
nM
koff
s-1
kon
M-1s-1
pHTemp
°C
Rho-associated protein kinase 2
(Homo sapiens (Human))
BDBM50338718
(2-(6-fluorochroman-3-yl)-8-methoxy-6-(1H-pyrazol-4...)
Show SMILES COc1cc(cc2c1nc([nH]c2=O)C1COc2ccc(F)cc2C1)-c1cn[nH]c1
Show InChI InChI=1S/C21H17FN4O3/c1-28-18-7-11(14-8-23-24-9-14)6-16-19(18)25-20(26-21(16)27)13-4-12-5-15(22)2-3-17(12)29-10-13/h2-3,5-9,13H,4,10H2,1H3,(H,23,24)(H,25,26,27)
n/an/a 1n/an/an/an/an/an/a
Translational Research Institute
Curated by ChEMBL
Assay Description
Inhibition of ROCK2 by HTRF assay
Bioorg Med Chem Lett 21: 1844-8 (2011)
Article DOI: 10.1016/j.bmcl.2011.01.039
BindingDB Entry DOI: 10.7270/Q20G3KFF