null
SMILES: CCCCc1ccc(cc1)S(=O)(=O)Nc1nncs1
InChI Key: InChIKey=OTPUUDOLWVWUGE-UHFFFAOYSA-N
Activity Spreadsheet -- Enzyme Inhibition Constant Data from BindingDB
Found 3 hits for monomerid = 50338946
Trg + Lig
Ki
nM
ΔG°
kcal/mole
IC50
nM
Kd
nM
EC50/IC50
nM
koff
s-1
kon
M-1s-1
pHTemp
°C
RAC-alpha serine/threonine-protein kinase [1-123]
(Homo sapiens (Human))
BDBM50338946
(4-Butyl-N-(1,3,4-thiadiazol-2-yl)benzenesulfonamid...)
Show SMILES CCCCc1ccc(cc1)S(=O)(=O)Nc1nncs1
Show InChI InChI=1S/C12H15N3O2S2/c1-2-3-4-10-5-7-11(8-6-10)19(16,17)15-12-14-13-9-18-12/h5-9H,2-4H2,1H3,(H,14,15)
US Patent
n/an/an/a 2.37E+4n/an/an/an/an/a
Board of Regents, The University of Texas System; Arizona Board of Regents on behalf of the University of Arizona
US Patent
Assay Description
SPR interaction analyses were performed with a Biacore 2000, using Biacore 2000 Control Software v3.2 and BIAevaluation v4.1 analysis software (Biaco...
US Patent US9320734 (2016)
BindingDB Entry DOI: 10.7270/Q2QF8RRM
RAC-alpha serine/threonine-protein kinase
(Mus musculus)
BDBM50338946
(4-Butyl-N-(1,3,4-thiadiazol-2-yl)benzenesulfonamid...)
Show SMILES CCCCc1ccc(cc1)S(=O)(=O)Nc1nncs1
Show InChI InChI=1S/C12H15N3O2S2/c1-2-3-4-10-5-7-11(8-6-10)19(16,17)15-12-14-13-9-18-12/h5-9H,2-4H2,1H3,(H,14,15)
Reactome pathway
>5.00E+4n/an/an/an/an/an/an/an/a
The University of Arizona
Curated by ChEMBL
Assay Description
Displacement of biotinylated phosphatidylinositol-3,4,5-phosphate from mouse AKT1 PH domain by surface plasmon resonance competitive binding assay
Bioorg Med Chem 19: 2046-54 (2011)
Article DOI: 10.1016/j.bmc.2011.01.049
BindingDB Entry DOI: 10.7270/Q2TQ61TR
RAC-alpha serine/threonine-protein kinase [1-123]
(Homo sapiens (Human))
BDBM50338946
(4-Butyl-N-(1,3,4-thiadiazol-2-yl)benzenesulfonamid...)
Show SMILES CCCCc1ccc(cc1)S(=O)(=O)Nc1nncs1
Show InChI InChI=1S/C12H15N3O2S2/c1-2-3-4-10-5-7-11(8-6-10)19(16,17)15-12-14-13-9-18-12/h5-9H,2-4H2,1H3,(H,14,15)
US Patent
>5.00E+4n/an/an/an/an/an/an/an/a
Board of Regents, The University of Texas System; Arizona Board of Regents on behalf of the University of Arizona
US Patent
Assay Description
SPR interaction analyses were performed with a Biacore 2000, using Biacore 2000 Control Software v3.2 and BIAevaluation v4.1 analysis software (Biaco...
US Patent US9320734 (2016)
BindingDB Entry DOI: 10.7270/Q2QF8RRM