BDBM50339088 6-[Ethyl-(4-isopropyl-3-pentyloxyphenyl)amino]nicotinic acid::CHEMBL1688390
SMILES: CCCCCOc1cc(ccc1C(C)C)N(CC)c1ccc(cn1)C(O)=O
InChI Key: InChIKey=JRBXGVGBWIDBDC-UHFFFAOYSA-N
Data: 1 EC50
Activity Spreadsheet -- Enzyme Inhibition Constant Data from BindingDB
Found 1 hit for monomerid = 50339088
Trg + Lig
Ki
nM
ΔG°
kcal/mole
IC50
nM
Kd
nM
EC50/IC50
nM
koff
s-1
kon
M-1s-1
pHTemp
°C
Retinoic acid receptor RXR-alpha
(Homo sapiens (Human))
BDBM50339088
(6-[Ethyl-(4-isopropyl-3-pentyloxyphenyl)amino]nico...)
Show SMILES CCCCCOc1cc(ccc1C(C)C)N(CC)c1ccc(cn1)C(O)=O
Show InChI InChI=1S/C22H30N2O3/c1-5-7-8-13-27-20-14-18(10-11-19(20)16(3)4)24(6-2)21-12-9-17(15-23-21)22(25)26/h9-12,14-16H,5-8,13H2,1-4H3,(H,25,26)
NCI pathway
Reactome pathway
n/an/an/an/a 160n/an/an/an/a
TBA
Curated by ChEMBL
Assay Description
Agonist activity at RXRalpha transfected in human COS1 cells after 18 hrs by luciferase reporter gene transactivation assay
ACS Med Chem Lett 1: 521-525 (2010)
Article DOI: 10.1021/ml100184k
BindingDB Entry DOI: 10.7270/Q28S4Q6X