BDBM50339131 4-(2-(trifluoromethyl)-10H-phenothiazin-10-yl)butan-1-amine::CHEMBL1688549
SMILES: NCCCCN1c2ccccc2Sc2ccc(cc12)C(F)(F)F
InChI Key: InChIKey=SHXYOOWNQCXHIT-UHFFFAOYSA-N
Data: 1 IC50
Activity Spreadsheet -- Enzyme Inhibition Constant Data from BindingDB
Found 1 hit for monomerid = 50339131
Trg + Lig
Ki
nM
ΔG°
kcal/mole
IC50
nM
Kd
nM
EC50/IC50
nM
koff
s-1
kon
M-1s-1
pHTemp
°C
Pleiotropic ABC efflux transporter of multiple drugs
(Saccharomyces cerevisiae S288c)
BDBM50339131
(4-(2-(trifluoromethyl)-10H-phenothiazin-10-yl)buta...)
Show SMILES NCCCCN1c2ccccc2Sc2ccc(cc12)C(F)(F)F
Show InChI InChI=1S/C17H17F3N2S/c18-17(19,20)12-7-8-16-14(11-12)22(10-4-3-9-21)13-5-1-2-6-15(13)23-16/h1-2,5-8,11H,3-4,9-10,21H2
n/an/a 1.30E+3n/an/an/an/an/an/a
Wroclaw Medical University
Curated by ChEMBL
Assay Description
Inhibition of Pdr5p-mediated rhodamine 6G transport in Saccharomyces cerevisiae MKPDR5h plasma membrane by spectrofluorometric assay
Antimicrob Agents Chemother 53: 1516-27 (2009)
Article DOI: 10.1128/AAC.00956-08
BindingDB Entry DOI: 10.7270/Q2125TNZ