BDBM50339150 5,7-dihydroxy-2-(4-hydroxyphenyl)-3-((2R,3S,4S,5S,6R)-3,4,5-trihydroxy-6-methyltetrahydro-2H-pyran-2-yloxy)-4H-chromen-4-one::CHEMBL515798::kaempferol-O3-alpha-rhamnopyranoside
SMILES: C[C@H]1O[C@H](Oc2c(O)c3c(cc(O)cc3=O)oc2-c2ccc(O)cc2)[C@@H](O)[C@@H](O)[C@@H]1O
InChI Key: InChIKey=ZWCVYHPDDFISLG-QBWVUYDZSA-N
Data: 1 IC50
Activity Spreadsheet -- Enzyme Inhibition Constant Data from BindingDB
Found 1 hit for monomerid = 50339150
Trg + Lig
Ki
nM
ΔG°
kcal/mole
IC50
nM
Kd
nM
EC50/IC50
nM
koff
s-1
kon
M-1s-1
pHTemp
°C
Ribosyldihydronicotinamide dehydrogenase [quinone]
(Homo sapiens (Human))
BDBM50339150
(5,7-dihydroxy-2-(4-hydroxyphenyl)-3-((2R,3S,4S,5S,...)
Show SMILES C[C@H]1O[C@H](Oc2c(O)c3c(cc(O)cc3=O)oc2-c2ccc(O)cc2)[C@@H](O)[C@@H](O)[C@@H]1O |r|
Show InChI InChI=1S/C21H20O10/c1-8-15(25)17(27)18(28)21(29-8)31-20-16(26)14-12(24)6-11(23)7-13(14)30-19(20)9-2-4-10(22)5-3-9/h2-8,15,17-18,21-23,25-28H,1H3/t8-,15-,17+,18+,21-/m1/s1
n/an/a 3.84E+3n/an/an/an/an/an/a
Yunnan Normal University
Curated by ChEMBL
Assay Description
Inhibition of human quinone reductase 2 expressed in Escherichia coli BL21(DE3) assessed as N-methyldihydronicotinamide oxidation per mg of protein a...
J Nat Prod 74: 129-36 (2011)
Article DOI: 10.1021/np100373f
BindingDB Entry DOI: 10.7270/Q20865MS