BDBM50339283 5-(chloromethyl)-3-(4-chlorophenyl)-2-(trifluoromethyl)pyrazolo[1,5-a]pyrimidin-7(4H)-one::CHEMBL1689656
SMILES: FC(F)(F)c1[nH]n2c(nc(CCl)cc2=O)c1-c1ccc(Cl)cc1
InChI Key: InChIKey=QZAOPTPIUYQMMK-UHFFFAOYSA-N
Data: 1 EC50
Activity Spreadsheet -- Enzyme Inhibition Constant Data from BindingDB
Found 1 hit for monomerid = 50339283
Trg + Lig
Ki
nM
ΔG°
kcal/mole
IC50
nM
Kd
nM
EC50/IC50
nM
koff
s-1
kon
M-1s-1
pHTemp
°C
Voltage-gated potassium channel subunit Kv7.2/Kv7.3
(Homo sapiens (Human))
BDBM50339283
(5-(chloromethyl)-3-(4-chlorophenyl)-2-(trifluorome...)
Show SMILES FC(F)(F)c1[nH]n2c(nc(CCl)cc2=O)c1-c1ccc(Cl)cc1
Show InChI InChI=1S/C14H8Cl2F3N3O/c15-6-9-5-10(23)22-13(20-9)11(12(21-22)14(17,18)19)7-1-3-8(16)4-2-7/h1-5,21H,6H2
n/an/an/an/a 2.33E+3n/an/an/an/a
Hebei Medical University
Curated by ChEMBL
Assay Description
Activation of KCNQ2/Q3 expressed in CHO cells by atomic absorption Rb'+ efflux assay
Eur J Med Chem 46: 934-43 (2011)
Article DOI: 10.1016/j.ejmech.2011.01.010
BindingDB Entry DOI: 10.7270/Q2TM7BDF