BDBM50339371 (+/-)-trans-3-(4-Chlorophenyl)-3-(4-hydroxycyclohex-2-enyloxy)-2-(4-nitrobenzyl)-2,3-dihydroisoindol-1-one::CHEMBL1688276
SMILES: O[C@H]1CC[C@H](OC2(N(Cc3ccc(cc3)[N+]([O-])=O)C(=O)c3ccccc23)c2ccc(Cl)cc2)C=C1
InChI Key: InChIKey=PUIQNHJMZHDIFX-WVJBAYLNSA-N
Data: 1 IC50
Activity Spreadsheet -- Enzyme Inhibition Constant Data from BindingDB
Found 1 hit for monomerid = 50339371
Trg + Lig
Ki
nM
ΔG°
kcal/mole
IC50
nM
Kd
nM
EC50/IC50
nM
koff
s-1
kon
M-1s-1
pHTemp
°C
E3 ubiquitin-protein ligase Mdm2
(Homo sapiens (Human))
BDBM50339371
((+/-)-trans-3-(4-Chlorophenyl)-3-(4-hydroxycyclohe...)
Show SMILES O[C@H]1CC[C@H](OC2(N(Cc3ccc(cc3)[N+]([O-])=O)C(=O)c3ccccc23)c2ccc(Cl)cc2)C=C1 |r,c:37|
Show InChI InChI=1S/C27H23ClN2O5/c28-20-9-7-19(8-10-20)27(35-23-15-13-22(31)14-16-23)25-4-2-1-3-24(25)26(32)29(27)17-18-5-11-21(12-6-18)30(33)34/h1-13,15,22-23,31H,14,16-17H2/t22-,23-,27?/m1/s1
NCI pathway
Reactome pathway
n/an/a 310n/an/an/an/an/an/a
Newcastle University
Curated by ChEMBL
Assay Description
Inhibition of Mdm2 -p53 protein interaction by ELISA
J Med Chem 54: 1233-43 (2011)
Article DOI: 10.1021/jm1011929
BindingDB Entry DOI: 10.7270/Q29K4BHN