BDBM50339611 (2S)-7-{[2-(acetylamino)pyridin-4-yl]oxy}-N-[3-(aminomethyl)-5-(trifluoromethyl)phenyl]-1,2,3,4-tetrahydronaphthalene-2-carboxamide::CHEMBL1688867
SMILES: CC(=O)Nc1cc(Oc2ccc3CC[C@@H](Cc3c2)C(=O)Nc2cc(CN)cc(c2)C(F)(F)F)ccn1
InChI Key: InChIKey=LFYSMIYDLWRAKU-SFHVURJKSA-N
Data: 2 IC50
Activity Spreadsheet -- Enzyme Inhibition Constant Data from BindingDB
Found 2 hits for monomerid = 50339611
Trg + Lig
Ki
nM
ΔG°
kcal/mole
IC50
nM
Kd
nM
EC50/IC50
nM
koff
s-1
kon
M-1s-1
pHTemp
°C
RAF proto-oncogene serine/threonine-protein kinase
(Homo sapiens (Human))
BDBM50339611
((2S)-7-{[2-(acetylamino)pyridin-4-yl]oxy}-N-[3-(am...)
Show SMILES CC(=O)Nc1cc(Oc2ccc3CC[C@@H](Cc3c2)C(=O)Nc2cc(CN)cc(c2)C(F)(F)F)ccn1 |r|
Show InChI InChI=1S/C26H25F3N4O3/c1-15(34)32-24-13-23(6-7-31-24)36-22-5-4-17-2-3-18(10-19(17)11-22)25(35)33-21-9-16(14-30)8-20(12-21)26(27,28)29/h4-9,11-13,18H,2-3,10,14,30H2,1H3,(H,33,35)(H,31,32,34)/t18-/m0/s1
NCI pathway
Reactome pathway
n/an/a 6n/an/an/an/an/an/a
Millennium Pharmaceuticals, Inc.
Curated by ChEMBL
Assay Description
Inhibition of C-Raf assessed as reduction in [33P]ATP incorporation into biotinylated substrate peptide after 3 hrs by flash plate assay
J Med Chem 54: 1836-46 (2011)
Article DOI: 10.1021/jm101479y
BindingDB Entry DOI: 10.7270/Q2DB824F
RAF proto-oncogene serine/threonine-protein kinase
(Homo sapiens (Human))
BDBM50339611
((2S)-7-{[2-(acetylamino)pyridin-4-yl]oxy}-N-[3-(am...)
Show SMILES CC(=O)Nc1cc(Oc2ccc3CC[C@@H](Cc3c2)C(=O)Nc2cc(CN)cc(c2)C(F)(F)F)ccn1 |r|
Show InChI InChI=1S/C26H25F3N4O3/c1-15(34)32-24-13-23(6-7-31-24)36-22-5-4-17-2-3-18(10-19(17)11-22)25(35)33-21-9-16(14-30)8-20(12-21)26(27,28)29/h4-9,11-13,18H,2-3,10,14,30H2,1H3,(H,33,35)(H,31,32,34)/t18-/m0/s1
NCI pathway
Reactome pathway
n/an/a 150n/an/an/an/an/an/a
Millennium Pharmaceuticals, Inc.
Curated by ChEMBL
Assay Description
Inhibition of raf kinase in human A375 cells assessed as decrease in MEK-mediated ERK phosphorylation after 3 hrs using 3,3',5,5'-tetramethylbenzidin...
J Med Chem 54: 1836-46 (2011)
Article DOI: 10.1021/jm101479y
BindingDB Entry DOI: 10.7270/Q2DB824F