BDBM50339627 1-(Benzo[d][1,3]dioxole-6-carbonyl)-3-(3-chlorophenyl)urea::CHEMBL1688878
SMILES: Clc1cccc(NC(=O)NC(=O)c2ccc3OCOc3c2)c1
InChI Key: InChIKey=BNSIXTRSQGXGNC-UHFFFAOYSA-N
Data: 1 IC50
Activity Spreadsheet -- Enzyme Inhibition Constant Data from BindingDB
Found 1 hit for monomerid = 50339627
Trg + Lig
Ki
nM
ΔG°
kcal/mole
IC50
nM
Kd
nM
EC50/IC50
nM
koff
s-1
kon
M-1s-1
pHTemp
°C
C-C chemokine receptor type 2
(Homo sapiens (Human))
BDBM50339627
(1-(Benzo[d][1,3]dioxole-6-carbonyl)-3-(3-chlorophe...)
Show SMILES Clc1cccc(NC(=O)NC(=O)c2ccc3OCOc3c2)c1
Show InChI InChI=1S/C15H11ClN2O4/c16-10-2-1-3-11(7-10)17-15(20)18-14(19)9-4-5-12-13(6-9)22-8-21-12/h1-7H,8H2,(H2,17,18,19,20)
n/an/a 1.60E+3n/an/an/an/an/an/a
Telik, Inc.
Curated by ChEMBL
Assay Description
Antagonist activity at CCR2 in human THP1 cells assessed as inhibition of CCL2-induced chemotaxis
J Med Chem 54: 1667-81 (2011)
Article DOI: 10.1021/jm1012903
BindingDB Entry DOI: 10.7270/Q28K79DQ