BDBM50339744 (5S)-N-[1-Ethyl-1-(4-methylphenyl)propyl]-2,7,7-trimethyl-5-phenyl-4,5,6,7-tetrahydropyrazolo[1,5-a]pyrimidine-3-carboxamide hydrochloride::CHEMBL1689048
SMILES: CCC(CC)(NC(=O)c1c(C)nn2c1N[C@@H](CC2(C)C)c1ccccc1)c1ccc(C)cc1
InChI Key: InChIKey=QDXRZFVLYYUMGO-QHCPKHFHSA-N
Data: 1 IC50
Activity Spreadsheet -- Enzyme Inhibition Constant Data from BindingDB
Found 1 hit for monomerid = 50339744
Trg + Lig
Ki
nM
ΔG°
kcal/mole
IC50
nM
Kd
nM
EC50/IC50
nM
koff
s-1
kon
M-1s-1
pHTemp
°C
Calcium-sensing receptor (CaSR)
(Homo sapiens (Human))
BDBM50339744
((5S)-N-[1-Ethyl-1-(4-methylphenyl)propyl]-2,7,7-tr...)
Show SMILES CCC(CC)(NC(=O)c1c(C)nn2c1N[C@@H](CC2(C)C)c1ccccc1)c1ccc(C)cc1 |r|
Show InChI InChI=1S/C28H36N4O/c1-7-28(8-2,22-16-14-19(3)15-17-22)30-26(33)24-20(4)31-32-25(24)29-23(18-27(32,5)6)21-12-10-9-11-13-21/h9-17,23,29H,7-8,18H2,1-6H3,(H,30,33)/t23-/m0/s1
n/an/a 31n/an/an/an/an/an/a
Takeda Pharmaceutical Company Ltd
Curated by ChEMBL
Assay Description
Antagonist activity at CaSR expressed in CHO cells assessed as inhibition of [35S]GTPgammaS binding after 10 mins by scintillation counting
Bioorg Med Chem 19: 1881-94 (2011)
Article DOI: 10.1016/j.bmc.2011.02.001
BindingDB Entry DOI: 10.7270/Q2MW2HFZ