BDBM50339813 CHEMBL1689284::N-[(3beta,18beta,20beta)-3,11-Dioxo-30-norolean-12-en-20-yl]urea
SMILES: C[C@@]1(CC[C@]2(C)CC[C@]3(C)C(=CC(=O)[C@@H]4[C@@]5(C)CCC(=O)C(C)(C)[C@@H]5CC[C@@]34C)[C@@H]2C1)NC(N)=O
InChI Key: InChIKey=OMQVRVGFRSPQIZ-LPXJIFNVSA-N
Data: 2 IC50
Activity Spreadsheet -- Enzyme Inhibition Constant Data from BindingDB
Found 2 hits for monomerid = 50339813
Trg + Lig
Ki
nM
ΔG°
kcal/mole
IC50
nM
Kd
nM
EC50/IC50
nM
koff
s-1
kon
M-1s-1
pHTemp
°C
11-beta-hydroxysteroid dehydrogenase 2
(Homo sapiens (Human))
BDBM50339813
(CHEMBL1689284 | N-[(3beta,18beta,20beta)-3,11-Diox...)
Show SMILES C[C@@]1(CC[C@]2(C)CC[C@]3(C)C(=CC(=O)[C@@H]4[C@@]5(C)CCC(=O)C(C)(C)[C@@H]5CC[C@@]34C)[C@@H]2C1)NC(N)=O |r,c:10|
Show InChI InChI=1S/C30H46N2O3/c1-25(2)21-8-11-30(7)23(28(21,5)10-9-22(25)34)20(33)16-18-19-17-27(4,32-24(31)35)14-12-26(19,3)13-15-29(18,30)6/h16,19,21,23H,8-15,17H2,1-7H3,(H3,31,32,35)/t19-,21-,23+,26+,27-,28-,29+,30+/m0/s1
n/an/a 45n/an/an/an/an/an/a
University of Technology
Curated by ChEMBL
Assay Description
Inhibition of human 11beta-HSD2 expressed in HEK293 cells assessed as conversion of [1,2,6,7-[3H]cortisol to cortisone after 10 mins by scintillation...
Bioorg Med Chem 19: 1866-80 (2011)
Article DOI: 10.1016/j.bmc.2011.02.005
BindingDB Entry DOI: 10.7270/Q2VD6ZR7
11-beta-hydroxysteroid dehydrogenase 1
(Homo sapiens (Human))
BDBM50339813
(CHEMBL1689284 | N-[(3beta,18beta,20beta)-3,11-Diox...)
Show SMILES C[C@@]1(CC[C@]2(C)CC[C@]3(C)C(=CC(=O)[C@@H]4[C@@]5(C)CCC(=O)C(C)(C)[C@@H]5CC[C@@]34C)[C@@H]2C1)NC(N)=O |r,c:10|
Show InChI InChI=1S/C30H46N2O3/c1-25(2)21-8-11-30(7)23(28(21,5)10-9-22(25)34)20(33)16-18-19-17-27(4,32-24(31)35)14-12-26(19,3)13-15-29(18,30)6/h16,19,21,23H,8-15,17H2,1-7H3,(H3,31,32,35)/t19-,21-,23+,26+,27-,28-,29+,30+/m0/s1
Reactome pathway
n/an/a>1.00E+4n/an/an/an/an/an/a
University of Technology
Curated by ChEMBL
Assay Description
Inhibition of human recombinant 11beta-HSD1 expressed in HEK293 cells assessed as conversion of [1,2-[3H]cortisone to cortisol after 10 mins by scint...
Bioorg Med Chem 19: 1866-80 (2011)
Article DOI: 10.1016/j.bmc.2011.02.005
BindingDB Entry DOI: 10.7270/Q2VD6ZR7