BDBM50339908 CHEMBL1191824::[(1R,2S)-2-aminocyclopentane-1-carboxylic acid]::cis-pentacin
SMILES: N[C@H]1CCC[C@H]1C(O)=O
InChI Key: InChIKey=JWYOAMOZLZXDER-UHNVWZDZSA-N
Data: 1 IC50
Activity Spreadsheet -- Enzyme Inhibition Constant Data from BindingDB
Found 1 hit for monomerid = 50339908
Trg + Lig
Ki
nM
ΔG°
kcal/mole
IC50
nM
Kd
nM
EC50/IC50
nM
koff
s-1
kon
M-1s-1
pHTemp
°C
L-cysteine:1D-myo-inositol 2-amino-2-deoxy-alpha-D-glucopyranoside ligase
(Mycobacterium tuberculosis)
BDBM50339908
(CHEMBL1191824 | [(1R,2S)-2-aminocyclopentane-1-car...)
Show SMILES N[C@H]1CCC[C@H]1C(O)=O |r|
Show InChI InChI=1S/C6H11NO2/c7-5-3-1-2-4(5)6(8)9/h4-5H,1-3,7H2,(H,8,9)/t4-,5+/m1/s1
Reactome pathway
n/an/a>4.00E+6n/an/an/an/an/an/a
National Institute of Diabetes and Digestive and Kidney Diseases
Curated by ChEMBL
Assay Description
Inhibition of Mycobacterium tuberculosis recombinant MBP-tagged MshC assessed as formation of fluorescently labeled Cys-GlcN-Ins by HPLC
Bioorg Med Chem Lett 21: 2480-3 (2011)
Article DOI: 10.1016/j.bmcl.2011.02.042
BindingDB Entry DOI: 10.7270/Q26Q1XKW