null
SMILES: CNC(=O)c1cc2ccc(CCNC(=O)Nc3ccc(F)c(c3)C(F)(F)F)cc2cn1
InChI Key: InChIKey=VOUWWDODJIGHCX-UHFFFAOYSA-N
Activity Spreadsheet -- Enzyme Inhibition Constant Data from BindingDB
Found 1 hit for monomerid = 50340260
Trg + Lig
Ki
nM
ΔG°
kcal/mole
IC50
nM
Kd
nM
EC50/IC50
nM
koff
s-1
kon
M-1s-1
pHTemp
°C
RAF proto-oncogene serine/threonine-protein kinase
(Homo sapiens (Human))
BDBM50340260
(7-(2-(3-(4-fluoro-3-(trifluoromethyl)phenyl)ureido...)
Show SMILES CNC(=O)c1cc2ccc(CCNC(=O)Nc3ccc(F)c(c3)C(F)(F)F)cc2cn1
Show InChI InChI=1S/C21H18F4N4O2/c1-26-19(30)18-9-13-3-2-12(8-14(13)11-28-18)6-7-27-20(31)29-15-4-5-17(22)16(10-15)21(23,24)25/h2-5,8-11H,6-7H2,1H3,(H,26,30)(H2,27,29,31)
NCI pathway
Reactome pathway
n/an/a 240n/an/an/an/an/an/a
Merck Serono
Curated by ChEMBL
Assay Description
Inhibition of human cRAF using [gamma-33P-ATP] as a substrate by scintillation counting
Bioorg Med Chem Lett 21: 2264-9 (2011)
Article DOI: 10.1016/j.bmcl.2011.02.108
BindingDB Entry DOI: 10.7270/Q2MS3T23