BDBM50340324 CHEMBL1760946::N-(2-(6-Methoxy-1H-pyrrolo[2,3-b]pyridin-1-yl)ethyl)propionamide
SMILES: CCC(=O)NCCn1ccc2ccc(OC)nc12
InChI Key: InChIKey=RQDRQFOSIGORHM-UHFFFAOYSA-N
Data: 2 KI  2 EC50
Activity Spreadsheet -- Enzyme Inhibition Constant Data from BindingDB
Found 4 hits for monomerid = 50340324
Trg + Lig
Ki
nM
ΔG°
kcal/mole
IC50
nM
Kd
nM
EC50/IC50
nM
koff
s-1
kon
M-1s-1
pHTemp
°C
Melatonin receptor
(Homo sapiens (Human))
BDBM50340324
(CHEMBL1760946 | N-(2-(6-Methoxy-1H-pyrrolo[2,3-b]p...)
Show SMILES CCC(=O)NCCn1ccc2ccc(OC)nc12
Show InChI InChI=1S/C13H17N3O2/c1-3-11(17)14-7-9-16-8-6-10-4-5-12(18-2)15-13(10)16/h4-6,8H,3,7,9H2,1-2H3,(H,14,17)
Reactome pathway
0.280n/an/an/an/an/an/an/an/a
Universit£ d'Orl£ans
Curated by ChEMBL
Assay Description
Displacement of 2-[125I]-iodomelatonin from human MT2 receptor expressed in HEK293 cells
Bioorg Med Chem Lett 21: 2316-9 (2011)
Article DOI: 10.1016/j.bmcl.2011.02.097
BindingDB Entry DOI: 10.7270/Q27H1JWM
Melatonin receptor
(Homo sapiens (Human))
BDBM50340324
(CHEMBL1760946 | N-(2-(6-Methoxy-1H-pyrrolo[2,3-b]p...)
Show SMILES CCC(=O)NCCn1ccc2ccc(OC)nc12
Show InChI InChI=1S/C13H17N3O2/c1-3-11(17)14-7-9-16-8-6-10-4-5-12(18-2)15-13(10)16/h4-6,8H,3,7,9H2,1-2H3,(H,14,17)
Reactome pathway
3.30n/an/an/an/an/an/an/an/a
Universit£ d'Orl£ans
Curated by ChEMBL
Assay Description
Displacement of 2-[125I]-iodomelatonin from human MT1 receptor expressed in HEK293 cells
Bioorg Med Chem Lett 21: 2316-9 (2011)
Article DOI: 10.1016/j.bmcl.2011.02.097
BindingDB Entry DOI: 10.7270/Q27H1JWM
Melatonin receptor
(Homo sapiens (Human))
BDBM50340324
(CHEMBL1760946 | N-(2-(6-Methoxy-1H-pyrrolo[2,3-b]p...)
Show SMILES CCC(=O)NCCn1ccc2ccc(OC)nc12
Show InChI InChI=1S/C13H17N3O2/c1-3-11(17)14-7-9-16-8-6-10-4-5-12(18-2)15-13(10)16/h4-6,8H,3,7,9H2,1-2H3,(H,14,17)
Reactome pathway
n/an/an/an/a 1.40n/an/an/an/a
Universit£ d'Orl£ans
Curated by ChEMBL
Assay Description
Agonist activity at human MT2 receptor expressed in CHO cells by [35S]GTPgamma binding assay
Bioorg Med Chem Lett 21: 2316-9 (2011)
Article DOI: 10.1016/j.bmcl.2011.02.097
BindingDB Entry DOI: 10.7270/Q27H1JWM
Melatonin receptor
(Homo sapiens (Human))
BDBM50340324
(CHEMBL1760946 | N-(2-(6-Methoxy-1H-pyrrolo[2,3-b]p...)
Show SMILES CCC(=O)NCCn1ccc2ccc(OC)nc12
Show InChI InChI=1S/C13H17N3O2/c1-3-11(17)14-7-9-16-8-6-10-4-5-12(18-2)15-13(10)16/h4-6,8H,3,7,9H2,1-2H3,(H,14,17)
Reactome pathway
n/an/an/an/a 5.10n/an/an/an/a
Universit£ d'Orl£ans
Curated by ChEMBL
Assay Description
Agonist activity at human MT1 receptor expressed in CHO cells by [35S]GTPgamma binding assay
Bioorg Med Chem Lett 21: 2316-9 (2011)
Article DOI: 10.1016/j.bmcl.2011.02.097
BindingDB Entry DOI: 10.7270/Q27H1JWM