BDBM50340328 CHEMBL1760955::N-(2-(6-methoxy-3-(2,2,2-trifluoroacetyl)-1H-pyrrolo[2,3-b]pyridin-1-yl)ethyl)acetamide
SMILES: COc1ccc2c(cn(CCNC(C)=O)c2n1)C(=O)C(F)(F)F
InChI Key: InChIKey=JDACSMSKZRUGMB-UHFFFAOYSA-N
Data: 2 KI  2 EC50
Activity Spreadsheet -- Enzyme Inhibition Constant Data from BindingDB
Found 4 hits for monomerid = 50340328
Trg + Lig
Ki
nM
ΔG°
kcal/mole
IC50
nM
Kd
nM
EC50/IC50
nM
koff
s-1
kon
M-1s-1
pHTemp
°C
Melatonin receptor
(Homo sapiens (Human))
BDBM50340328
(CHEMBL1760955 | N-(2-(6-methoxy-3-(2,2,2-trifluoro...)
Show SMILES COc1ccc2c(cn(CCNC(C)=O)c2n1)C(=O)C(F)(F)F
Show InChI InChI=1S/C14H14F3N3O3/c1-8(21)18-5-6-20-7-10(12(22)14(15,16)17)9-3-4-11(23-2)19-13(9)20/h3-4,7H,5-6H2,1-2H3,(H,18,21)
Reactome pathway
30n/an/an/an/an/an/an/an/a
Universit£ d'Orl£ans
Curated by ChEMBL
Assay Description
Displacement of 2-[125I]-iodomelatonin from human MT2 receptor expressed in HEK293 cells
Bioorg Med Chem Lett 21: 2316-9 (2011)
Article DOI: 10.1016/j.bmcl.2011.02.097
BindingDB Entry DOI: 10.7270/Q27H1JWM
Melatonin receptor
(Homo sapiens (Human))
BDBM50340328
(CHEMBL1760955 | N-(2-(6-methoxy-3-(2,2,2-trifluoro...)
Show SMILES COc1ccc2c(cn(CCNC(C)=O)c2n1)C(=O)C(F)(F)F
Show InChI InChI=1S/C14H14F3N3O3/c1-8(21)18-5-6-20-7-10(12(22)14(15,16)17)9-3-4-11(23-2)19-13(9)20/h3-4,7H,5-6H2,1-2H3,(H,18,21)
Reactome pathway
91n/an/an/an/an/an/an/an/a
Universit£ d'Orl£ans
Curated by ChEMBL
Assay Description
Displacement of 2-[125I]-iodomelatonin from human MT1 receptor expressed in HEK293 cells
Bioorg Med Chem Lett 21: 2316-9 (2011)
Article DOI: 10.1016/j.bmcl.2011.02.097
BindingDB Entry DOI: 10.7270/Q27H1JWM
Melatonin receptor
(Homo sapiens (Human))
BDBM50340328
(CHEMBL1760955 | N-(2-(6-methoxy-3-(2,2,2-trifluoro...)
Show SMILES COc1ccc2c(cn(CCNC(C)=O)c2n1)C(=O)C(F)(F)F
Show InChI InChI=1S/C14H14F3N3O3/c1-8(21)18-5-6-20-7-10(12(22)14(15,16)17)9-3-4-11(23-2)19-13(9)20/h3-4,7H,5-6H2,1-2H3,(H,18,21)
Reactome pathway
n/an/an/an/a 93n/an/an/an/a
Universit£ d'Orl£ans
Curated by ChEMBL
Assay Description
Agonist activity at human MT1 receptor expressed in CHO cells by [35S]GTPgamma binding assay
Bioorg Med Chem Lett 21: 2316-9 (2011)
Article DOI: 10.1016/j.bmcl.2011.02.097
BindingDB Entry DOI: 10.7270/Q27H1JWM
Melatonin receptor
(Homo sapiens (Human))
BDBM50340328
(CHEMBL1760955 | N-(2-(6-methoxy-3-(2,2,2-trifluoro...)
Show SMILES COc1ccc2c(cn(CCNC(C)=O)c2n1)C(=O)C(F)(F)F
Show InChI InChI=1S/C14H14F3N3O3/c1-8(21)18-5-6-20-7-10(12(22)14(15,16)17)9-3-4-11(23-2)19-13(9)20/h3-4,7H,5-6H2,1-2H3,(H,18,21)
Reactome pathway
n/an/an/an/a 10n/an/an/an/a
Universit£ d'Orl£ans
Curated by ChEMBL
Assay Description
Agonist activity at human MT2 receptor expressed in CHO cells by [35S]GTPgamma binding assay
Bioorg Med Chem Lett 21: 2316-9 (2011)
Article DOI: 10.1016/j.bmcl.2011.02.097
BindingDB Entry DOI: 10.7270/Q27H1JWM