BDBM50340400 3-(4-(2-(ethylthio)ethyl)bicyclo[2.2.2]octan-1-yl)-4-methyl-5-(2-(trifluoromethyl)phenyl)-4H-1,2,4-triazole::CHEMBL1761311
SMILES: CCSCCC12CCC(CC1)(CC2)c1nnc(-c2ccccc2C(F)(F)F)n1C
InChI Key: InChIKey=UAYZIYYBLXQLES-UHFFFAOYSA-N
Data: 4 IC50
Activity Spreadsheet -- Enzyme Inhibition Constant Data from BindingDB
Found 4 hits for monomerid = 50340400
Trg + Lig
Ki
nM
ΔG°
kcal/mole
IC50
nM
Kd
nM
EC50/IC50
nM
koff
s-1
kon
M-1s-1
pHTemp
°C
11-beta-Hydroxysteroid Dehydrogenase 2 (11-beta-HSD2)
(Mus musculus (mouse))
BDBM50340400
(3-(4-(2-(ethylthio)ethyl)bicyclo[2.2.2]octan-1-yl)...)
Show SMILES CCSCCC12CCC(CC1)(CC2)c1nnc(-c2ccccc2C(F)(F)F)n1C
Show InChI InChI=1S/C22H28F3N3S/c1-3-29-15-14-20-8-11-21(12-9-20,13-10-20)19-27-26-18(28(19)2)16-6-4-5-7-17(16)22(23,24)25/h4-7H,3,8-15H2,1-2H3
n/an/a>4.00E+3n/an/an/an/an/an/a
Merck Research Laboratories
Curated by ChEMBL
Assay Description
Inhibition of mouse 11beta-HSD2 expressed in CHO-K1 cells assessed as conversion of [3H]-cortisol to [3H]-cortisone by scintillation proximity assay
Bioorg Med Chem Lett 21: 2568-72 (2011)
Article DOI: 10.1016/j.bmcl.2011.01.018
BindingDB Entry DOI: 10.7270/Q2QJ7HMK
11-beta-hydroxysteroid dehydrogenase 1
(Mus musculus (mouse))
BDBM50340400
(3-(4-(2-(ethylthio)ethyl)bicyclo[2.2.2]octan-1-yl)...)
Show SMILES CCSCCC12CCC(CC1)(CC2)c1nnc(-c2ccccc2C(F)(F)F)n1C
Show InChI InChI=1S/C22H28F3N3S/c1-3-29-15-14-20-8-11-21(12-9-20,13-10-20)19-27-26-18(28(19)2)16-6-4-5-7-17(16)22(23,24)25/h4-7H,3,8-15H2,1-2H3
Reactome pathway
n/an/a 3.90n/an/an/an/an/an/a
Merck Research Laboratories
Curated by ChEMBL
Assay Description
Inhibition of mouse 11beta-HSD1 expressed in CHO-K1 cells assessed as conversion of [3H]-cortisone to [3H]-cortisol by scintillation proximity assay
Bioorg Med Chem Lett 21: 2568-72 (2011)
Article DOI: 10.1016/j.bmcl.2011.01.018
BindingDB Entry DOI: 10.7270/Q2QJ7HMK
11-beta-hydroxysteroid dehydrogenase 1
(Homo sapiens (Human))
BDBM50340400
(3-(4-(2-(ethylthio)ethyl)bicyclo[2.2.2]octan-1-yl)...)
Show SMILES CCSCCC12CCC(CC1)(CC2)c1nnc(-c2ccccc2C(F)(F)F)n1C
Show InChI InChI=1S/C22H28F3N3S/c1-3-29-15-14-20-8-11-21(12-9-20,13-10-20)19-27-26-18(28(19)2)16-6-4-5-7-17(16)22(23,24)25/h4-7H,3,8-15H2,1-2H3
Reactome pathway
n/an/a 3.30n/an/an/an/an/an/a
Merck Research Laboratories
Curated by ChEMBL
Assay Description
Inhibition of human 11beta-HSD1 expressed in CHO-K1 cells assessed as conversion of [3H]-cortisone to [3H]-cortisol by scintillation proximity assay
Bioorg Med Chem Lett 21: 2568-72 (2011)
Article DOI: 10.1016/j.bmcl.2011.01.018
BindingDB Entry DOI: 10.7270/Q2QJ7HMK
11-beta-hydroxysteroid dehydrogenase 2
(Homo sapiens (Human))
BDBM50340400
(3-(4-(2-(ethylthio)ethyl)bicyclo[2.2.2]octan-1-yl)...)
Show SMILES CCSCCC12CCC(CC1)(CC2)c1nnc(-c2ccccc2C(F)(F)F)n1C
Show InChI InChI=1S/C22H28F3N3S/c1-3-29-15-14-20-8-11-21(12-9-20,13-10-20)19-27-26-18(28(19)2)16-6-4-5-7-17(16)22(23,24)25/h4-7H,3,8-15H2,1-2H3
n/an/a>4.00E+3n/an/an/an/an/an/a
Merck Research Laboratories
Curated by ChEMBL
Assay Description
Inhibition of human 11beta-HSD2 expressed in CHO-K1 cells assessed as conversion of [3H]-cortisol to [3H]-cortisone by scintillation proximity assay
Bioorg Med Chem Lett 21: 2568-72 (2011)
Article DOI: 10.1016/j.bmcl.2011.01.018
BindingDB Entry DOI: 10.7270/Q2QJ7HMK