BDBM50340417 5-(3-(((3R,4S)-N-cyclopropyl-4-(4-(2-(2,6-dichloro-4-methylphenoxy)ethoxy)phenyl)piperidine-3-carboxamido)methyl)-5-(3-methoxypropyl)phenoxy)-2,2-dimethylpentanoic acid::CHEMBL1761533
SMILES: COCCCc1cc(CN(C2CC2)C(=O)[C@H]2CNCC[C@@H]2c2ccc(OCCOc3c(Cl)cc(C)cc3Cl)cc2)cc(OCCCC(C)(C)C(O)=O)c1
InChI Key: InChIKey=NASKVDWGYKOGBO-XDSPJLLDSA-N
Data: 1 KI  4 IC50
Activity Spreadsheet -- Enzyme Inhibition Constant Data from BindingDB
Found 5 hits for monomerid = 50340417
Trg + Lig
Ki
nM
ΔG°
kcal/mole
IC50
nM
Kd
nM
EC50/IC50
nM
koff
s-1
kon
M-1s-1
pHTemp
°C
Potassium voltage-gated channel subfamily H member 2
(Homo sapiens (Human))
BDBM50340417
(5-(3-(((3R,4S)-N-cyclopropyl-4-(4-(2-(2,6-dichloro...)
Show SMILES COCCCc1cc(CN(C2CC2)C(=O)[C@H]2CNCC[C@@H]2c2ccc(OCCOc3c(Cl)cc(C)cc3Cl)cc2)cc(OCCCC(C)(C)C(O)=O)c1 |r|
Show InChI InChI=1S/C42H54Cl2N2O7/c1-28-21-37(43)39(38(44)22-28)53-20-19-52-33-12-8-31(9-13-33)35-14-16-45-26-36(35)40(47)46(32-10-11-32)27-30-23-29(7-5-17-50-4)24-34(25-30)51-18-6-15-42(2,3)41(48)49/h8-9,12-13,21-25,32,35-36,45H,5-7,10-11,14-20,26-27H2,1-4H3,(H,48,49)/t35-,36+/m1/s1
Reactome pathway
200n/an/an/an/an/an/an/an/a
Merck Frosst Centre for Therapeutic Research
Curated by ChEMBL
Assay Description
Binding affinity to human ERG
Bioorg Med Chem Lett 21: 2430-6 (2011)
Article DOI: 10.1016/j.bmcl.2011.02.067
BindingDB Entry DOI: 10.7270/Q2G16157
Renin
(Homo sapiens (Human))
BDBM50340417
(5-(3-(((3R,4S)-N-cyclopropyl-4-(4-(2-(2,6-dichloro...)
Show SMILES COCCCc1cc(CN(C2CC2)C(=O)[C@H]2CNCC[C@@H]2c2ccc(OCCOc3c(Cl)cc(C)cc3Cl)cc2)cc(OCCCC(C)(C)C(O)=O)c1 |r|
Show InChI InChI=1S/C42H54Cl2N2O7/c1-28-21-37(43)39(38(44)22-28)53-20-19-52-33-12-8-31(9-13-33)35-14-16-45-26-36(35)40(47)46(32-10-11-32)27-30-23-29(7-5-17-50-4)24-34(25-30)51-18-6-15-42(2,3)41(48)49/h8-9,12-13,21-25,32,35-36,45H,5-7,10-11,14-20,26-27H2,1-4H3,(H,48,49)/t35-,36+/m1/s1
Reactome pathway
n/an/a 6.10n/an/an/an/an/an/a
Merck Frosst Centre for Therapeutic Research
Curated by ChEMBL
Assay Description
Inhibition of human recombinant renin in human citrated-plasma
Bioorg Med Chem Lett 21: 2430-6 (2011)
Article DOI: 10.1016/j.bmcl.2011.02.067
BindingDB Entry DOI: 10.7270/Q2G16157
Cytochrome P450 3A4
(Homo sapiens (Human))
BDBM50340417
(5-(3-(((3R,4S)-N-cyclopropyl-4-(4-(2-(2,6-dichloro...)
Show SMILES COCCCc1cc(CN(C2CC2)C(=O)[C@H]2CNCC[C@@H]2c2ccc(OCCOc3c(Cl)cc(C)cc3Cl)cc2)cc(OCCCC(C)(C)C(O)=O)c1 |r|
Show InChI InChI=1S/C42H54Cl2N2O7/c1-28-21-37(43)39(38(44)22-28)53-20-19-52-33-12-8-31(9-13-33)35-14-16-45-26-36(35)40(47)46(32-10-11-32)27-30-23-29(7-5-17-50-4)24-34(25-30)51-18-6-15-42(2,3)41(48)49/h8-9,12-13,21-25,32,35-36,45H,5-7,10-11,14-20,26-27H2,1-4H3,(H,48,49)/t35-,36+/m1/s1
Reactome pathway
n/an/a>5.00E+4n/an/an/an/an/an/a
Merck Frosst Centre for Therapeutic Research
Curated by ChEMBL
Assay Description
Inhibition of human CYP3A4 in human liver microsomes assessed as formation of 6beta-hydroxy-testosterone using testosterone as substrate by high thro...
Bioorg Med Chem Lett 21: 2430-6 (2011)
Article DOI: 10.1016/j.bmcl.2011.02.067
BindingDB Entry DOI: 10.7270/Q2G16157
Cytochrome P450 3A4
(Homo sapiens (Human))
BDBM50340417
(5-(3-(((3R,4S)-N-cyclopropyl-4-(4-(2-(2,6-dichloro...)
Show SMILES COCCCc1cc(CN(C2CC2)C(=O)[C@H]2CNCC[C@@H]2c2ccc(OCCOc3c(Cl)cc(C)cc3Cl)cc2)cc(OCCCC(C)(C)C(O)=O)c1 |r|
Show InChI InChI=1S/C42H54Cl2N2O7/c1-28-21-37(43)39(38(44)22-28)53-20-19-52-33-12-8-31(9-13-33)35-14-16-45-26-36(35)40(47)46(32-10-11-32)27-30-23-29(7-5-17-50-4)24-34(25-30)51-18-6-15-42(2,3)41(48)49/h8-9,12-13,21-25,32,35-36,45H,5-7,10-11,14-20,26-27H2,1-4H3,(H,48,49)/t35-,36+/m1/s1
Reactome pathway
n/an/a>5.00E+4n/an/an/an/an/an/a
Merck Frosst Centre for Therapeutic Research
Curated by ChEMBL
Assay Description
Inhibition of human CYP3A4 in human liver microsomes assessed as formation of 6beta-hydroxy-testosterone using testosterone as substrate by high thro...
Bioorg Med Chem Lett 21: 2430-6 (2011)
Article DOI: 10.1016/j.bmcl.2011.02.067
BindingDB Entry DOI: 10.7270/Q2G16157
Renin
(Homo sapiens (Human))
BDBM50340417
(5-(3-(((3R,4S)-N-cyclopropyl-4-(4-(2-(2,6-dichloro...)
Show SMILES COCCCc1cc(CN(C2CC2)C(=O)[C@H]2CNCC[C@@H]2c2ccc(OCCOc3c(Cl)cc(C)cc3Cl)cc2)cc(OCCCC(C)(C)C(O)=O)c1 |r|
Show InChI InChI=1S/C42H54Cl2N2O7/c1-28-21-37(43)39(38(44)22-28)53-20-19-52-33-12-8-31(9-13-33)35-14-16-45-26-36(35)40(47)46(32-10-11-32)27-30-23-29(7-5-17-50-4)24-34(25-30)51-18-6-15-42(2,3)41(48)49/h8-9,12-13,21-25,32,35-36,45H,5-7,10-11,14-20,26-27H2,1-4H3,(H,48,49)/t35-,36+/m1/s1
Reactome pathway
n/an/a 0.0100n/an/an/an/a7.4n/a
Merck Frosst Centre for Therapeutic Research
Curated by ChEMBL
Assay Description
Inhibition of human recombinant renin in PBS buffer using tetradecapeptide at pH 7.4
Bioorg Med Chem Lett 21: 2430-6 (2011)
Article DOI: 10.1016/j.bmcl.2011.02.067
BindingDB Entry DOI: 10.7270/Q2G16157