BDBM50340560 (4-methyl-3-(methyl(2-(3-morpholino-5-(morpholinomethyl)phenylamino)pyrimidin-4-yl)amino)phenyl)methanol::CHEMBL1762541
SMILES: CN(c1ccnc(Nc2cc(CN3CCOCC3)cc(c2)N2CCOCC2)n1)c1cc(CO)ccc1C
InChI Key: InChIKey=JQTSMXRKIUPZQM-UHFFFAOYSA-N
Data: 2 IC50
Activity Spreadsheet -- Enzyme Inhibition Constant Data from BindingDB
Found 2 hits for monomerid = 50340560
Trg + Lig
Ki
nM
ΔG°
kcal/mole
IC50
nM
Kd
nM
EC50/IC50
nM
koff
s-1
kon
M-1s-1
pHTemp
°C
Ephrin type-B receptor 4
(Homo sapiens (Human))
BDBM50340560
((4-methyl-3-(methyl(2-(3-morpholino-5-(morpholinom...)
Show SMILES CN(c1ccnc(Nc2cc(CN3CCOCC3)cc(c2)N2CCOCC2)n1)c1cc(CO)ccc1C
Show InChI InChI=1S/C28H36N6O3/c1-21-3-4-22(20-35)17-26(21)32(2)27-5-6-29-28(31-27)30-24-15-23(19-33-7-11-36-12-8-33)16-25(18-24)34-9-13-37-14-10-34/h3-6,15-18,35H,7-14,19-20H2,1-2H3,(H,29,30,31)
Reactome pathway
n/an/a 6n/an/an/an/an/an/a
Centre de Recherches
Curated by ChEMBL
Assay Description
Inhibition of human EPHB4
Bioorg Med Chem Lett 21: 2207-11 (2011)
Article DOI: 10.1016/j.bmcl.2011.03.009
BindingDB Entry DOI: 10.7270/Q2PK0GGR
Ephrin type-B receptor 4
(Homo sapiens (Human))
BDBM50340560
((4-methyl-3-(methyl(2-(3-morpholino-5-(morpholinom...)
Show SMILES CN(c1ccnc(Nc2cc(CN3CCOCC3)cc(c2)N2CCOCC2)n1)c1cc(CO)ccc1C
Show InChI InChI=1S/C28H36N6O3/c1-21-3-4-22(20-35)17-26(21)32(2)27-5-6-29-28(31-27)30-24-15-23(19-33-7-11-36-12-8-33)16-25(18-24)34-9-13-37-14-10-34/h3-6,15-18,35H,7-14,19-20H2,1-2H3,(H,29,30,31)
Reactome pathway
n/an/a 25n/an/an/an/an/an/a
Centre de Recherches
Curated by ChEMBL
Assay Description
Inhibition of human EphB4 autophosphorylation expressed in CHOK1 cells
Bioorg Med Chem Lett 21: 2207-11 (2011)
Article DOI: 10.1016/j.bmcl.2011.03.009
BindingDB Entry DOI: 10.7270/Q2PK0GGR