BDBM50340681 CHEMBL1762410::N-(4-amino-2-methylquinolin-6-yl)-2-[4-(9-aminononylaminomethyl)phenoxymethyl]benzamide
SMILES: Cc1cc(N)c2cc(NC(=O)c3ccccc3COc3ccc(CNCCCCCCCCCN)cc3)ccc2n1
InChI Key: InChIKey=RZYZZBRLERPXRY-UHFFFAOYSA-N
Data: 3 IC50
Activity Spreadsheet -- Enzyme Inhibition Constant Data from BindingDB
Found 3 hits for monomerid = 50340681
Trg + Lig
Ki
nM
ΔG°
kcal/mole
IC50
nM
Kd
nM
EC50/IC50
nM
koff
s-1
kon
M-1s-1
pHTemp
°C
Nociceptin receptor
(Homo sapiens (Human))
BDBM50340681
(CHEMBL1762410 | N-(4-amino-2-methylquinolin-6-yl)-...)
Show SMILES Cc1cc(N)c2cc(NC(=O)c3ccccc3COc3ccc(CNCCCCCCCCCN)cc3)ccc2n1
Show InChI InChI=1S/C34H43N5O2/c1-25-21-32(36)31-22-28(15-18-33(31)38-25)39-34(40)30-12-8-7-11-27(30)24-41-29-16-13-26(14-17-29)23-37-20-10-6-4-2-3-5-9-19-35/h7-8,11-18,21-22,37H,2-6,9-10,19-20,23-24,35H2,1H3,(H2,36,38)(H,39,40)
Reactome pathway
n/an/a 212n/an/an/an/an/an/a
Istituto Superiore di Sanit£
Curated by ChEMBL
Assay Description
Displacement of [125I]Tyr14-nociceptin from human NOP receptor expressed in human HEK293 cells after 2 hrs by scintillation counting
Eur J Med Chem 46: 1207-21 (2011)
Article DOI: 10.1016/j.ejmech.2011.01.040
BindingDB Entry DOI: 10.7270/Q2NK3FBC
Mu-type opioid receptor
(Homo sapiens (Human))
BDBM50340681
(CHEMBL1762410 | N-(4-amino-2-methylquinolin-6-yl)-...)
Show SMILES Cc1cc(N)c2cc(NC(=O)c3ccccc3COc3ccc(CNCCCCCCCCCN)cc3)ccc2n1
Show InChI InChI=1S/C34H43N5O2/c1-25-21-32(36)31-22-28(15-18-33(31)38-25)39-34(40)30-12-8-7-11-27(30)24-41-29-16-13-26(14-17-29)23-37-20-10-6-4-2-3-5-9-19-35/h7-8,11-18,21-22,37H,2-6,9-10,19-20,23-24,35H2,1H3,(H2,36,38)(H,39,40)
NCI pathway
Reactome pathway
n/an/a 7.07E+3n/an/an/an/an/an/a
Istituto Superiore di Sanit£
Curated by ChEMBL
Assay Description
Displacement of [3H]-naltrindole from human mu opioid receptor expressed in CHO cells after 2 hrs by scintillation counting
Eur J Med Chem 46: 1207-21 (2011)
Article DOI: 10.1016/j.ejmech.2011.01.040
BindingDB Entry DOI: 10.7270/Q2NK3FBC
Kappa-type opioid receptor
(Homo sapiens (Human))
BDBM50340681
(CHEMBL1762410 | N-(4-amino-2-methylquinolin-6-yl)-...)
Show SMILES Cc1cc(N)c2cc(NC(=O)c3ccccc3COc3ccc(CNCCCCCCCCCN)cc3)ccc2n1
Show InChI InChI=1S/C34H43N5O2/c1-25-21-32(36)31-22-28(15-18-33(31)38-25)39-34(40)30-12-8-7-11-27(30)24-41-29-16-13-26(14-17-29)23-37-20-10-6-4-2-3-5-9-19-35/h7-8,11-18,21-22,37H,2-6,9-10,19-20,23-24,35H2,1H3,(H2,36,38)(H,39,40)
Reactome pathway
n/an/a 6.18E+3n/an/an/an/an/an/a
Istituto Superiore di Sanit£
Curated by ChEMBL
Assay Description
Displacement of [3H]-naltrindole from human kappa opioid receptor expressed in human HEK293 cells after 2 hrs by scintillation counting
Eur J Med Chem 46: 1207-21 (2011)
Article DOI: 10.1016/j.ejmech.2011.01.040
BindingDB Entry DOI: 10.7270/Q2NK3FBC