BDBM50340720 (E)-N-(4-amino-2-methylquinolin-6-yl)-2-[4-(hexyliminomethyl)phenoxymethyl]benzamide::CHEMBL1762392
SMILES: CCCCCC\N=C\c1ccc(OCc2ccccc2C(=O)Nc2ccc3nc(C)cc(N)c3c2)cc1
InChI Key: InChIKey=QRNDHNRVGQNOQG-FMFFXOCNSA-N
Data: 1 IC50
Activity Spreadsheet -- Enzyme Inhibition Constant Data from BindingDB
Found 1 hit for monomerid = 50340720
Trg + Lig
Ki
nM
ΔG°
kcal/mole
IC50
nM
Kd
nM
EC50/IC50
nM
koff
s-1
kon
M-1s-1
pHTemp
°C
Nociceptin receptor
(Homo sapiens (Human))
BDBM50340720
((E)-N-(4-amino-2-methylquinolin-6-yl)-2-[4-(hexyli...)
Show SMILES CCCCCC\N=C\c1ccc(OCc2ccccc2C(=O)Nc2ccc3nc(C)cc(N)c3c2)cc1
Show InChI InChI=1S/C31H34N4O2/c1-3-4-5-8-17-33-20-23-11-14-26(15-12-23)37-21-24-9-6-7-10-27(24)31(36)35-25-13-16-30-28(19-25)29(32)18-22(2)34-30/h6-7,9-16,18-20H,3-5,8,17,21H2,1-2H3,(H2,32,34)(H,35,36)/b33-20+
Reactome pathway
n/an/a 209n/an/an/an/an/an/a
Istituto Superiore di Sanit£
Curated by ChEMBL
Assay Description
Displacement of [125I]Tyr14-nociceptin from human NOP receptor expressed in human HEK293 cells after 2 hrs by scintillation counting
Eur J Med Chem 46: 1207-21 (2011)
Article DOI: 10.1016/j.ejmech.2011.01.040
BindingDB Entry DOI: 10.7270/Q2NK3FBC