BDBM50340814 5-(4-(5-(1-(4-chlorophenyl)cyclobutyl)-4-methyl-4H-1,2,4-triazol-3-yl)phenyl)pyrimidin-2-ol::CHEMBL1760792
SMILES: Cn1c(nnc1C1(CCC1)c1ccc(Cl)cc1)-c1ccc(cc1)-c1cnc(=O)[nH]c1
InChI Key: InChIKey=CATBWTNVXOHMMB-UHFFFAOYSA-N
Data: 4 IC50  1 EC50
Activity Spreadsheet -- Enzyme Inhibition Constant Data from BindingDB
Found 5 hits for monomerid = 50340814
Trg + Lig
Ki
nM
ΔG°
kcal/mole
IC50
nM
Kd
nM
EC50/IC50
nM
koff
s-1
kon
M-1s-1
pHTemp
°C
Pregnane X receptor
(Homo sapiens (Human))
BDBM50340814
(5-(4-(5-(1-(4-chlorophenyl)cyclobutyl)-4-methyl-4H...)
Show SMILES Cn1c(nnc1C1(CCC1)c1ccc(Cl)cc1)-c1ccc(cc1)-c1cnc(=O)[nH]c1
Show InChI InChI=1S/C23H20ClN5O/c1-29-20(16-5-3-15(4-6-16)17-13-25-22(30)26-14-17)27-28-21(29)23(11-2-12-23)18-7-9-19(24)10-8-18/h3-10,13-14H,2,11-12H2,1H3,(H,25,26,30)
n/an/an/an/a>3.00E+4n/an/an/an/a
Merck& Co
Curated by ChEMBL
Assay Description
Agonist activity at PXR
Bioorg Med Chem Lett 21: 2141-5 (2011)
Article DOI: 10.1016/j.bmcl.2011.01.125
BindingDB Entry DOI: 10.7270/Q2W37WNN
11-beta-hydroxysteroid dehydrogenase 2
(Homo sapiens (Human))
BDBM50340814
(5-(4-(5-(1-(4-chlorophenyl)cyclobutyl)-4-methyl-4H...)
Show SMILES Cn1c(nnc1C1(CCC1)c1ccc(Cl)cc1)-c1ccc(cc1)-c1cnc(=O)[nH]c1
Show InChI InChI=1S/C23H20ClN5O/c1-29-20(16-5-3-15(4-6-16)17-13-25-22(30)26-14-17)27-28-21(29)23(11-2-12-23)18-7-9-19(24)10-8-18/h3-10,13-14H,2,11-12H2,1H3,(H,25,26,30)
n/an/a>4.00E+3n/an/an/an/an/an/a
Merck& Co
Curated by ChEMBL
Assay Description
Inhibition of human 11beta-HSD2
Bioorg Med Chem Lett 21: 2141-5 (2011)
Article DOI: 10.1016/j.bmcl.2011.01.125
BindingDB Entry DOI: 10.7270/Q2W37WNN
11-beta-hydroxysteroid dehydrogenase 1
(Mus musculus (mouse))
BDBM50340814
(5-(4-(5-(1-(4-chlorophenyl)cyclobutyl)-4-methyl-4H...)
Show SMILES Cn1c(nnc1C1(CCC1)c1ccc(Cl)cc1)-c1ccc(cc1)-c1cnc(=O)[nH]c1
Show InChI InChI=1S/C23H20ClN5O/c1-29-20(16-5-3-15(4-6-16)17-13-25-22(30)26-14-17)27-28-21(29)23(11-2-12-23)18-7-9-19(24)10-8-18/h3-10,13-14H,2,11-12H2,1H3,(H,25,26,30)
Reactome pathway
n/an/a 2.90n/an/an/an/an/an/a
Merck& Co
Curated by ChEMBL
Assay Description
Inhibition of mouse 11beta-HSD1 expressed in CHO-K1 cells assessed as conversion of [3H]cortisone to [3H]cortisol by scintillation counting
Bioorg Med Chem Lett 21: 2141-5 (2011)
Article DOI: 10.1016/j.bmcl.2011.01.125
BindingDB Entry DOI: 10.7270/Q2W37WNN
11-beta-hydroxysteroid dehydrogenase 1
(Homo sapiens (Human))
BDBM50340814
(5-(4-(5-(1-(4-chlorophenyl)cyclobutyl)-4-methyl-4H...)
Show SMILES Cn1c(nnc1C1(CCC1)c1ccc(Cl)cc1)-c1ccc(cc1)-c1cnc(=O)[nH]c1
Show InChI InChI=1S/C23H20ClN5O/c1-29-20(16-5-3-15(4-6-16)17-13-25-22(30)26-14-17)27-28-21(29)23(11-2-12-23)18-7-9-19(24)10-8-18/h3-10,13-14H,2,11-12H2,1H3,(H,25,26,30)
Reactome pathway
n/an/a 1.20n/an/an/an/an/an/a
Merck& Co
Curated by ChEMBL
Assay Description
Inhibition of human 11beta-HSD1 expressed in CHO-K1 cells assessed as conversion of [3H]cortisone to [3H]cortisol by scintillation counting
Bioorg Med Chem Lett 21: 2141-5 (2011)
Article DOI: 10.1016/j.bmcl.2011.01.125
BindingDB Entry DOI: 10.7270/Q2W37WNN
11-beta-Hydroxysteroid Dehydrogenase 2 (11-beta-HSD2)
(Mus musculus (mouse))
BDBM50340814
(5-(4-(5-(1-(4-chlorophenyl)cyclobutyl)-4-methyl-4H...)
Show SMILES Cn1c(nnc1C1(CCC1)c1ccc(Cl)cc1)-c1ccc(cc1)-c1cnc(=O)[nH]c1
Show InChI InChI=1S/C23H20ClN5O/c1-29-20(16-5-3-15(4-6-16)17-13-25-22(30)26-14-17)27-28-21(29)23(11-2-12-23)18-7-9-19(24)10-8-18/h3-10,13-14H,2,11-12H2,1H3,(H,25,26,30)
n/an/a>4.00E+3n/an/an/an/an/an/a
Merck& Co
Curated by ChEMBL
Assay Description
Inhibition of mouse 11beta-HSD2
Bioorg Med Chem Lett 21: 2141-5 (2011)
Article DOI: 10.1016/j.bmcl.2011.01.125
BindingDB Entry DOI: 10.7270/Q2W37WNN