BDBM50340815 5-(4-(5-(1-(4-chlorophenyl)cyclobutyl)-4-methyl-4H-1,2,4-triazol-3-yl)phenyl)-2,4-dimethoxypyrimidine::CHEMBL1760793
SMILES: COc1ncc(-c2ccc(cc2)-c2nnc(n2C)C2(CCC2)c2ccc(Cl)cc2)c(OC)n1
InChI Key: InChIKey=TYBKJRHHHDQHNG-UHFFFAOYSA-N
Data: 4 IC50  1 EC50
Activity Spreadsheet -- Enzyme Inhibition Constant Data from BindingDB
Found 5 hits for monomerid = 50340815
Trg + Lig
Ki
nM
ΔG°
kcal/mole
IC50
nM
Kd
nM
EC50/IC50
nM
koff
s-1
kon
M-1s-1
pHTemp
°C
Pregnane X receptor
(Homo sapiens (Human))
BDBM50340815
(5-(4-(5-(1-(4-chlorophenyl)cyclobutyl)-4-methyl-4H...)
Show SMILES COc1ncc(-c2ccc(cc2)-c2nnc(n2C)C2(CCC2)c2ccc(Cl)cc2)c(OC)n1
Show InChI InChI=1S/C25H24ClN5O2/c1-31-21(29-30-23(31)25(13-4-14-25)18-9-11-19(26)12-10-18)17-7-5-16(6-8-17)20-15-27-24(33-3)28-22(20)32-2/h5-12,15H,4,13-14H2,1-3H3
n/an/an/an/a>3.00E+4n/an/an/an/a
Merck& Co
Curated by ChEMBL
Assay Description
Agonist activity at PXR
Bioorg Med Chem Lett 21: 2141-5 (2011)
Article DOI: 10.1016/j.bmcl.2011.01.125
BindingDB Entry DOI: 10.7270/Q2W37WNN
11-beta-hydroxysteroid dehydrogenase 2
(Homo sapiens (Human))
BDBM50340815
(5-(4-(5-(1-(4-chlorophenyl)cyclobutyl)-4-methyl-4H...)
Show SMILES COc1ncc(-c2ccc(cc2)-c2nnc(n2C)C2(CCC2)c2ccc(Cl)cc2)c(OC)n1
Show InChI InChI=1S/C25H24ClN5O2/c1-31-21(29-30-23(31)25(13-4-14-25)18-9-11-19(26)12-10-18)17-7-5-16(6-8-17)20-15-27-24(33-3)28-22(20)32-2/h5-12,15H,4,13-14H2,1-3H3
n/an/a>4.00E+3n/an/an/an/an/an/a
Merck& Co
Curated by ChEMBL
Assay Description
Inhibition of human 11beta-HSD2
Bioorg Med Chem Lett 21: 2141-5 (2011)
Article DOI: 10.1016/j.bmcl.2011.01.125
BindingDB Entry DOI: 10.7270/Q2W37WNN
11-beta-hydroxysteroid dehydrogenase 1
(Mus musculus (mouse))
BDBM50340815
(5-(4-(5-(1-(4-chlorophenyl)cyclobutyl)-4-methyl-4H...)
Show SMILES COc1ncc(-c2ccc(cc2)-c2nnc(n2C)C2(CCC2)c2ccc(Cl)cc2)c(OC)n1
Show InChI InChI=1S/C25H24ClN5O2/c1-31-21(29-30-23(31)25(13-4-14-25)18-9-11-19(26)12-10-18)17-7-5-16(6-8-17)20-15-27-24(33-3)28-22(20)32-2/h5-12,15H,4,13-14H2,1-3H3
Reactome pathway
n/an/a 2n/an/an/an/an/an/a
Merck& Co
Curated by ChEMBL
Assay Description
Inhibition of mouse 11beta-HSD1 expressed in CHO-K1 cells assessed as conversion of [3H]cortisone to [3H]cortisol by scintillation counting
Bioorg Med Chem Lett 21: 2141-5 (2011)
Article DOI: 10.1016/j.bmcl.2011.01.125
BindingDB Entry DOI: 10.7270/Q2W37WNN
11-beta-hydroxysteroid dehydrogenase 1
(Homo sapiens (Human))
BDBM50340815
(5-(4-(5-(1-(4-chlorophenyl)cyclobutyl)-4-methyl-4H...)
Show SMILES COc1ncc(-c2ccc(cc2)-c2nnc(n2C)C2(CCC2)c2ccc(Cl)cc2)c(OC)n1
Show InChI InChI=1S/C25H24ClN5O2/c1-31-21(29-30-23(31)25(13-4-14-25)18-9-11-19(26)12-10-18)17-7-5-16(6-8-17)20-15-27-24(33-3)28-22(20)32-2/h5-12,15H,4,13-14H2,1-3H3
Reactome pathway
n/an/a 14n/an/an/an/an/an/a
Merck& Co
Curated by ChEMBL
Assay Description
Inhibition of human 11beta-HSD1 expressed in CHO-K1 cells assessed as conversion of [3H]cortisone to [3H]cortisol by scintillation counting
Bioorg Med Chem Lett 21: 2141-5 (2011)
Article DOI: 10.1016/j.bmcl.2011.01.125
BindingDB Entry DOI: 10.7270/Q2W37WNN
11-beta-Hydroxysteroid Dehydrogenase 2 (11-beta-HSD2)
(Mus musculus (mouse))
BDBM50340815
(5-(4-(5-(1-(4-chlorophenyl)cyclobutyl)-4-methyl-4H...)
Show SMILES COc1ncc(-c2ccc(cc2)-c2nnc(n2C)C2(CCC2)c2ccc(Cl)cc2)c(OC)n1
Show InChI InChI=1S/C25H24ClN5O2/c1-31-21(29-30-23(31)25(13-4-14-25)18-9-11-19(26)12-10-18)17-7-5-16(6-8-17)20-15-27-24(33-3)28-22(20)32-2/h5-12,15H,4,13-14H2,1-3H3
n/an/a>4.00E+3n/an/an/an/an/an/a
Merck& Co
Curated by ChEMBL
Assay Description
Inhibition of mouse 11beta-HSD2
Bioorg Med Chem Lett 21: 2141-5 (2011)
Article DOI: 10.1016/j.bmcl.2011.01.125
BindingDB Entry DOI: 10.7270/Q2W37WNN