BDBM50340908 (4-amino-2-(pyridin-3-ylamino)thiazol-5-yl)(3-methoxyphenyl)methanone::CHEMBL1761797
SMILES: COc1cccc(c1)C(=O)c1sc(Nc2cccnc2)nc1N
InChI Key: InChIKey=IVPOEQUCSQIXKZ-UHFFFAOYSA-N
Data: 1 IC50
Activity Spreadsheet -- Enzyme Inhibition Constant Data from BindingDB
Found 1 hit for monomerid = 50340908
Trg + Lig
Ki
nM
ΔG°
kcal/mole
IC50
nM
Kd
nM
EC50/IC50
nM
koff
s-1
kon
M-1s-1
pHTemp
°C
Cyclin-Dependent Kinase 5 (CDK5)
(Homo sapiens (Human))
BDBM50340908
((4-amino-2-(pyridin-3-ylamino)thiazol-5-yl)(3-meth...)
Show SMILES COc1cccc(c1)C(=O)c1sc(Nc2cccnc2)nc1N
Show InChI InChI=1S/C16H14N4O2S/c1-22-12-6-2-4-10(8-12)13(21)14-15(17)20-16(23-14)19-11-5-3-7-18-9-11/h2-9H,17H2,1H3,(H,19,20)
NCI pathway
Reactome pathway
n/an/a 11n/an/an/an/an/an/a
Harvard Medical School
Curated by ChEMBL
Assay Description
Inhibition of CDK5/p25 assessed as [33P]gamma-ATP incorporation into peptide PKTPKKAKKL substrate after 45 mins by scintillation counter
Bioorg Med Chem Lett 21: 2098-101 (2011)
Article DOI: 10.1016/j.bmcl.2011.01.140
BindingDB Entry DOI: 10.7270/Q2GT5NG8